{"text_format":"1","workbook":"xlsx","n_sheets":7,"sheets":["Instructions","Input","Reports","Tax","Dialog","Module1","CCA Rate Table"],"not_rendered":{"charts":0,"images":0,"macros":1,"external_links":0,"defined_names":22,"comments":1,"pivot_tables":0},"unopened":[{"sheet":"Dialog","index":4,"reason":"not_a_worksheet"},{"sheet":"Module1","index":5,"reason":"part_missing"}],"bounds":{"document_bytes":16777216,"sheet_cells":100000,"rows_first":2000,"rows_last":500,"rows_between":2000,"halvings":0,"cell_chars":16384,"cell_head_chars":4096},"cells_cut":0,"cells_raw":0,"read":"whole","date_system":"1900"}

{"sheet":"Instructions","index":0,"n_rows":193,"n_cols":4,"rows_kept":193,"cut":false,"hidden":false,"merged":[]}
["This is a farm business decision calculator that has 5 worksheets. There are fields that can be completed by the user. It is up to 19 columns wide and 191 rows."]
["CASH BASIS CAPITAL INVESTMENT WORKSHEET"]
[]
[" A BUDGETING WORKSHEET developed by:"]
[]
["Agriculture Development Branch"]
["Business Management Unit"]
["Ontario Ministry of Agriculture, Food and Rural Affairs"]
[]
["Revised December 2016"]
["NOTICE"]
["Information contained in this document is derived from sources believed to be accurate.  The user of this worksheet assumes all responsibility. "]
[]
["Reproduction of the contents or spreadsheet, in whole or in part, is permitted with suitable credit."]
[]
["TABLE OF CONTENTS"]
["Click on the Table of Content items below to go to that section:"]
["Purpose and Scope of the Cash Basis Capital Investment Worksheet "]
["Required Rate of Return (Present Value)"]
["Data Entry"]
{"$rows_left_out":174}
{"sheet":"Input","index":1,"n_rows":62,"n_cols":17,"rows_kept":62,"cut":false,"hidden":false,"merged":[]}
[null,null,null,null,null,null,null,null,null,null,"   ADDED COSTS AND REDUCED RETURNS"]
[null,null,null,"Ministry of Agriculture, Food and Rural Affairs",null,null,null,null,null,null,null,null,null,null,null,null,"NOTE:"]
[null,null,null,"AGRICULTURE DEVELOPMENT BRANCH",null,null,null,null,null,"ADDED OPERATING EXPENSES",null,null,"INFLATION FACTOR",null,"  AMOUNT",null,"Entries  Go from"]
[null,null,null,"BUSINESS MANAGEMENT UNIT",null,null,null,null,null,null,null,null,null,null,null,null,"Line 1 to 60"]
[null,null,null,null,null,null,null,null,null,null,"Feed",null,0,"%",160000]
[null,null,null,null,null,null,null,null,null,null,"Health & Breeding",null,2,"%",900]
[null,null,"        CASH BASIS CAPITAL INVESTMENT WORKSHEET",null,null,null,null,null,null,null,"Marketing",null,2,"%",9320]
[null,null,null,null,null,null,null,null,null,null,"Hydro Telephone",null,3,"%",3540]
[null,null,null,null,null,null,null,null,null,null,"Repairs and maintenance",null,3,"%",4260]
[null,"NAME:","Jolene and Joe Farms",null,null,"DATE:",{"$f":"NOW()","v":"2024-11-29T15:38:56.810"},null,null,null,"Labour",null,2,"%",8000]
[null,null,null,null,null,null,null,null,null,null,"Operating interest",null,0.1,"%",1840]
[null,"PROPOSED INVESTMENT:",null,"2000 head hog finishing barn",null,null,null,null,null,null,"Livestock purchases",null,0,"%",140000]
[null,null,null,null,null,null,null,null,null,null,"Taxes & insurance",null,2,"%",2840]
[null,"- BASIC INFORMATION -",null,null,null,null,null,null,null,null,".",null,0,"%",0]
[null,null,null,null,null,null,null,null,null,null,".",null,0,"%",0]
[null,"REQUIRED RATE OF RETURN:",null,5,"%","# OF YEARS OF PROJECTION:",null,15,null,null,".",null,0,"%",0]
[null,"DOWN PAYMENT PROVIDED :",null,200000,null," ( MAXIMUM 15 YEARS )",null,null,null,null,".",null,0,"%",0]
[null,null,null,null,null,null,null,null,null,"REDUCED INCOME",null,null,"INFLATION FACTOR",null,"  AMOUNT"]
[null,"PRESENT TAXABLE INCOME:",null,null,null,40000]
[null,null,null,null,null,"Business Structure Codes:",null,null,null,null,"Down Pymnt Interest Lost",null,"YOUR RATE OF RETURN",null,{"$f":"Reports!E49","v":10000}]
{"$rows_left_out":43}
{"sheet":"Reports","index":2,"n_rows":195,"n_cols":35,"rows_kept":195,"cut":false,"hidden":false,"merged":[]}
[]
[null,null,null,null,null,null,null,null,null,null,null,"Ministry of Agriculture, Food and Rural Affairs"]
[null,null,null,null,null,null,"CASH BASIS CAPITAL INVESTMENT WORKSHEET",null,null,null,null,"AGRICULTURE DEVELOPMENT BRANCH"]
[null,null,null,null,null,null,null,null,null,null,null,"BUSINESS MANAGEMENT UNIT"]
[]
["    - Basic Information -",null,null,"                                    - Loan Information -",null,null,null,null,null,null,null,null,null,null,null,{"$f":"Input!F10","v":"DATE:"},{"$f":"NOW()","v":"2024-11-29T15:38:56.810"}]
[null,null,null,null,"LOAN #1",null,null,null,"LOAN #2",null,null,null,"LOAN #3"]
["Required Rate of Return  (%)",null,{"$f":"Input!D16","v":5},"       Loan Requirement",null,null,{"$f":"IF(Input!G29>0,Input!G29,0.001)","v":42000},"       Loan Requirement",null,null,{"$f":"IF(Input!G36>0,Input!G36,0.001)","v":688000},"       Loan Requirement",null,null,{"$f":"IF(Input!G43>0,Input!G43,0.001)","v":1E-3}]
["Down Payment Provided",null,{"$f":"Input!D17","v":200000},"       Interest Rate",null,null,{"$f":"Input!G30","v":5},"       Interest Rate",null,null,{"$f":"Input!G37","v":5},"       Interest Rate",null,null,{"$f":"Input!G44","v":5}]
["# of Years of Projection",null,{"$f":"Input!H16","v":15},"       Term (Years)",null,null,{"$f":"Input!G31","v":10},"       Term (Years)",null,null,{"$f":"Input!G38","v":20},"       Term (Years)",null,null,{"$f":"Input!G45","v":7}]
["(Maximum 15 Years)",null,null,"       Payments / Year",null,null,{"$f":"Input!G32","v":12},"       Payments / Year",null,null,{"$f":"Input!G39","v":12},"       Payments / Year",null,null,{"$f":"Input!G46","v":12}]
["Total Capital Expense:",null,{"$f":"C9+G8+K8+O8","v":930000.00100000005},"      Compounding Periods / Year",null,null,{"$f":"Input!G33","v":12},"      Compounding Periods / Year",null,null,{"$f":"Input!G40","v":12},"      Compounding Periods / Year",null,null,{"$f":"Input!G47","v":12}]
[null,null,null,"       Loan Payment",null,null,{"$f":"PMT(((1+(G9/(G12*100)))^(G12/G11)-1),G10*G11,-G8)","v":445.4751640041157},"       Loan Payment",null,null,{"$f":"PMT(((1+(K9/(K12*100)))^(K12/K11)-1),K10*K11,-K8)","v":4540.4954858105957},"       Loan Payment",null,null,{"$f":"PMT(((1+(O9/(O12*100)))^(O12/O11)-1),O10*O11,-O8)","v":1.4133909071906999E-5}]
[null,"Only the # of years of Projection specified",null,"      Annual Loan Payments",null,null,{"$f":"G13*G11","v":5345.7019680493886},"      Annual Loan Payments",null,null,{"$f":"K13*K11","v":54485.945829727149},"      Annual Loan Payments",null,null,{"$f":"O13*O11","v":1.6960690886288398E-4}]
[null,"above are included in Net Present "]
[null,"Value Calculation column.","Net",null,"Years>",null,null,"Years"]
[null,null,"Present",null,1,2,3,4,5,6,7,8,9,10,11,12,13,14,15,null,"NPV by projection years selected"]
[null,null,"Value",null,null,null,null,null,null,null,null,null,null,null,null,null,null,null,null,null,"1 year","2 year","3 year","4 year","5 year","6 year","7 year","8 year","9 year","10 year","11 year","12 year","13 year","14 year","15 year"]
[null,"DISADVANTAGES"," Outst. Pr. #1>",null,{"$f":"G8","v":42000},{"$f":"IF(+E19-E23>0,+E19-E23,0)","v":38678.87454712233},35187.834012972104,31518.185219512696,27660.790229220493,23606.043590345453,19343.848417995985,14863.59125148676,{"$f":"IF(+L19-L23>0,+L19-L23,0)","v":10154.115625340688},5203.6942881332197,0,0,0,0,0]
[null,null," Outst. Pr. #2>",null,{"$f":"K8","v":688000},667447.29781202937,645843.08037352411,623133.5501686153,599262.15729842079,574169.45866390667,547792.9699442765,520067.01000229386,490922.53732908651,460286.97812115558,428084.04556147871,394233.54985469131,358651.1985433072,321248.3866077381,281931.97582743177]
{"$rows_left_out":176}
{"sheet":"Tax","index":3,"n_rows":70,"n_cols":26,"rows_kept":70,"cut":false,"hidden":false,"merged":[]}
["Combined Federal & Ontario Tax Brackets and Tax Rates Including Surtaxes - 2016"]
[null,null,null,null,null,null,"Ministry of Agriculture, Food and Rural Affairs"]
[null,null,null,null,null,null,"AGRICULTURE DEVELOPMENT BRANCH"]
[null,null,null,null,null,null,"BUSINESS MANAGEMENT UNIT"]
["Sole Proprietorship",null,null,null,"Years>"]
[null,null,null,null,1,2,3,4,5,6,7,8,9,10,11,12,13,14,15]
[null,"Taxable Income:  Before",{"$f":"Input!F19","v":40000},"After:",{"$f":"Reports!E105","v":-25257.820204148826},{"$f":"Reports!F105","v":-78582.282277178252},{"$f":"Reports!G105","v":-73204.316782207927},{"$f":"Reports!H105","v":-67716.731500645168},{"$f":"Reports!I105","v":-62112.129447735089},{"$f":"Reports!J105","v":-56382.938518957817},{"$f":"Reports!K105","v":-50521.451894149999},{"$f":"Reports!L105","v":-44519.882306566695},{"$f":"Reports!M105","v":-38370.434288771299},{"$f":"Reports!N105","v":-82065.399968277721},{"$f":"Reports!O105","v":-31086.375682565675},{"$f":"Reports!P105","v":-24689.332056629471},{"$f":"Reports!Q105","v":-18161.121425634308},{"$f":"Reports!R105","v":-11496.483714372269},{"$f":"Reports!S105","v":-4690.9964098827331}]
[]
[null,"Tax payable:        Before",{"$f":"IF(C7<0.01,0,IF(C7<0.01,0,IF(C7>$K$59,$I$59+($B$60*(C7-$K$59)),IF(C7>$K$58,$I$58+($B$59*(C7-$K$58)),IF(C7>$K$57,$I$57+($B$58*(C7-$K$57)),IF(C7>$K$56, $I$56+($B$57*(C7-$K$56)),IF(C7>$K$55,$I$55+($B$56*(C7-$K$55)),IF(C7>$K$54,$I$54+($B$55*(C7-$K$54)),IF(C7>$K$53,$I$53+($B$54*(C7-$K$53)),IF(C7>$K$52,$I$52+($B$53*(C7-$K$52)),IF(C7>$K$51,$I$51+($B$52*(C7-$K$51)),IF(C7>$K$50,$I$50+($B$51*(C7-$K$50)),$B$50*C7)))))))))))-MIN(C7*$A$35,$B$63)-MIN(C7*$A$29,$B$65))","v":5793.3445000000011}," After:",{"$f":"IF(E7<0.01,0,IF(E7<0.01,0,IF(E7>$K$59,$I$59+($B$60*(E7-$K$59)),IF(E7>$K$58,$I$58+($B$59*(E7-$K$58)),IF(E7>$K$57,$I$57+($B$58*(E7-$K$57)),IF(E7>$K$56, $I$56+($B$57*(E7-$K$56)),IF(E7>$K$55,$I$55+($B$56*(E7-$K$55)),IF(E7>$K$54,$I$54+($B$55*(E7-$K$54)),IF(E7>$K$53,$I$53+($B$54*(E7-$K$53)),IF(E7>$K$52,$I$52+($B$53*(E7-$K$52)),IF(E7>$K$51,$I$51+($B$52*(E7-$K$51)),IF(E7>$K$50,$I$50+($B$51*(E7-$K$50)),$B$50*E7)))))))))))-MIN(E7*$A$35,$B$63)-MIN(E7*$A$29,$B$65))","v":0},0,0,0,0,0,0,0,0,0,0,0,0,0,0]
[]
[]
["Partnership"]
[]
[null,"Taxable Income:  Before",{"$f":"Input!F19","v":40000},"After:",{"$f":"E7","v":-25257.820204148826},{"$f":"F7","v":-78582.282277178252},-73204.316782207927,-67716.731500645168,-62112.129447735089,-56382.938518957817,-50521.451894149999,-44519.882306566695,-38370.434288771299,-82065.399968277721,-31086.375682565675,-24689.332056629471,-18161.121425634308,-11496.483714372269,-4690.9964098827331]
[null,"Partners Income:  Before",{"$f":"IF(Input!$E$23>0,Input!$F$19/Input!$E$23,Input!$F$19)","v":20000},"After:",{"$f":"IF(Input!$E$23>0,E$7/Input!$E$23,E$7)","v":-12628.910102074413},{"$f":"IF(Input!$E$23>0,F$7/Input!$E$23,F$7)","v":-39291.141138589126},{"$f":"IF(Input!$E$23>0,G$7/Input!$E$23,G$7)","v":-36602.158391103963},{"$f":"IF(Input!$E$23>0,H$7/Input!$E$23,H$7)","v":-33858.365750322584},{"$f":"IF(Input!$E$23>0,I$7/Input!$E$23,I$7)","v":-31056.064723867545},{"$f":"IF(Input!$E$23>0,J$7/Input!$E$23,J$7)","v":-28191.469259478908},{"$f":"IF(Input!$E$23>0,K$7/Input!$E$23,K$7)","v":-25260.725947075},{"$f":"IF(Input!$E$23>0,L$7/Input!$E$23,L$7)","v":-22259.941153283347},{"$f":"IF(Input!$E$23>0,M$7/Input!$E$23,M$7)","v":-19185.21714438565},{"$f":"IF(Input!$E$23>0,N$7/Input!$E$23,N$7)","v":-41032.699984138861},{"$f":"IF(Input!$E$23>0,O$7/Input!$E$23,O$7)","v":-15543.187841282837},{"$f":"IF(Input!$E$23>0,P$7/Input!$E$23,P$7)","v":-12344.666028314736},{"$f":"IF(Input!$E$23>0,Q$7/Input!$E$23,Q$7)","v":-9080.5607128171541},{"$f":"IF(Input!$E$23>0,R$7/Input!$E$23,R$7)","v":-5748.2418571861344},{"$f":"IF(Input!$E$23>0,S$7/Input!$E$23,S$7)","v":-2345.4982049413666}]
[null,"Total Tax payable: Before",{"$f":"IF(C15<0.01,0,IF(Input!$E$23>0,IF(C15<0.01,0,IF(C15>$K$59,$I$59+($B$60*(C15-$K$59)),IF(C15>$K$58,$I$58+($B$59*(C15-$K$58)),IF(C15>$K$57,$I$57+($B$58*(C15-$K$57)),IF(C15>$K$56, $I$56+($B$57*(C15-$K$56)),IF(C15>$K$55,$I$55+($B$56*(C15-$K$55)),IF(C15>$K$54,$I$54+($B$55*(C15-$K$54)),IF(C15>$K$53,$I$53+($B$54*(C15-$K$53)),IF(C15>$K$52,$I$52+($B$53*(C15-$K$52)),IF(C15>$K$51,$I$51+($B$52*(C15-$K$51)),IF(C15>$K$50,$I$50+($B$51*(C15-$K$50)),$B$50*C15)))))))))))-MIN(C15*$A$35,$B$63)-MIN(C15*$A$29,$B$65),C9)*Input!$E$23)","v":3566.6890000000012},"After:",{"$f":"IF(E15<0.01,0,IF(Input!$E$23>0,IF(E15<0.01,0,IF(E15>$K$59,$I$59+($B$60*(E15-$K$59)),IF(E15>$K$58,$I$58+($B$59*(E15-$K$58)),IF(E15>$K$57,$I$57+($B$58*(E15-$K$57)),IF(E15>$K$56, $I$56+($B$57*(E15-$K$56)),IF(E15>$K$55,$I$55+($B$56*(E15-$K$55)),IF(E15>$K$54,$I$54+($B$55*(E15-$K$54)),IF(E15>$K$53,$I$53+($B$54*(E15-$K$53)),IF(E15>$K$52,$I$52+($B$53*(E15-$K$52)),IF(E15>$K$51,$I$51+($B$52*(E15-$K$51)),IF(E15>$K$50,$I$50+($B$51*(E15-$K$50)),$B$50*E15)))))))))))-MIN(E15*$A$35,$B$63)-MIN(E15*$A$29,$B$65),E9)*Input!$E$23)","v":0},{"$f":"IF(F15<0.01,0,IF(Input!$E$23>0,IF(F15<0.01,0,IF(F15>$K$59,$I$59+($B$60*(F15-$K$59)),IF(F15>$K$58,$I$58+($B$59*(F15-$K$58)),IF(F15>$K$57,$I$57+($B$58*(F15-$K$57)),IF(F15>$K$56, $I$56+($B$57*(F15-$K$56)),IF(F15>$K$55,$I$55+($B$56*(F15-$K$55)),IF(F15>$K$54,$I$54+($B$55*(F15-$K$54)),IF(F15>$K$53,$I$53+($B$54*(F15-$K$53)),IF(F15>$K$52,$I$52+($B$53*(F15-$K$52)),IF(F15>$K$51,$I$51+($B$52*(F15-$K$51)),IF(F15>$K$50,$I$50+($B$51*(F15-$K$50)),$B$50*F15)))))))))))-MIN(F15*$A$35,$B$63)-MIN(F15*$A$29,$B$65),F9)*Input!$E$23)","v":0},{"$f":"IF(G15<0.01,0,IF(Input!$E$23>0,IF(G15<0.01,0,IF(G15>$K$59,$I$59+($B$60*(G15-$K$59)),IF(G15>$K$58,$I$58+($B$59*(G15-$K$58)),IF(G15>$K$57,$I$57+($B$58*(G15-$K$57)),IF(G15>$K$56, $I$56+($B$57*(G15-$K$56)),IF(G15>$K$55,$I$55+($B$56*(G15-$K$55)),IF(G15>$K$54,$I$54+($B$55*(G15-$K$54)),IF(G15>$K$53,$I$53+($B$54*(G15-$K$53)),IF(G15>$K$52,$I$52+($B$53*(G15-$K$52)),IF(G15>$K$51,$I$51+($B$52*(G15-$K$51)),IF(G15>$K$50,$I$50+($B$51*(G15-$K$50)),$B$50*G15)))))))))))-MIN(G15*$A$35,$B$63)-MIN(G15*$A$29,$B$65),G9)*Input!$E$23)","v":0},{"$f":"IF(H15<0.01,0,IF(Input!$E$23>0,IF(H15<0.01,0,IF(H15>$K$59,$I$59+($B$60*(H15-$K$59)),IF(H15>$K$58,$I$58+($B$59*(H15-$K$58)),IF(H15>$K$57,$I$57+($B$58*(H15-$K$57)),IF(H15>$K$56, $I$56+($B$57*(H15-$K$56)),IF(H15>$K$55,$I$55+($B$56*(H15-$K$55)),IF(H15>$K$54,$I$54+($B$55*(H15-$K$54)),IF(H15>$K$53,$I$53+($B$54*(H15-$K$53)),IF(H15>$K$52,$I$52+($B$53*(H15-$K$52)),IF(H15>$K$51,$I$51+($B$52*(H15-$K$51)),IF(H15>$K$50,$I$50+($B$51*(H15-$K$50)),$B$50*H15)))))))))))-MIN(H15*$A$35,$B$63)-MIN(H15*$A$29,$B$65),H9)*Input!$E$23)","v":0},{"$f":"IF(I15<0.01,0,IF(Input!$E$23>0,IF(I15<0.01,0,IF(I15>$K$59,$I$59+($B$60*(I15-$K$59)),IF(I15>$K$58,$I$58+($B$59*(I15-$K$58)),IF(I15>$K$57,$I$57+($B$58*(I15-$K$57)),IF(I15>$K$56, $I$56+($B$57*(I15-$K$56)),IF(I15>$K$55,$I$55+($B$56*(I15-$K$55)),IF(I15>$K$54,$I$54+($B$55*(I15-$K$54)),IF(I15>$K$53,$I$53+($B$54*(I15-$K$53)),IF(I15>$K$52,$I$52+($B$53*(I15-$K$52)),IF(I15>$K$51,$I$51+($B$52*(I15-$K$51)),IF(I15>$K$50,$I$50+($B$51*(I15-$K$50)),$B$50*I15)))))))))))-MIN(I15*$A$35,$B$63)-MIN(I15*$A$29,$B$65),I9)*Input!$E$23)","v":0},{"$f":"IF(J15<0.01,0,IF(Input!$E$23>0,IF(J15<0.01,0,IF(J15>$K$59,$I$59+($B$60*(J15-$K$59)),IF(J15>$K$58,$I$58+($B$59*(J15-$K$58)),IF(J15>$K$57,$I$57+($B$58*(J15-$K$57)),IF(J15>$K$56, $I$56+($B$57*(J15-$K$56)),IF(J15>$K$55,$I$55+($B$56*(J15-$K$55)),IF(J15>$K$54,$I$54+($B$55*(J15-$K$54)),IF(J15>$K$53,$I$53+($B$54*(J15-$K$53)),IF(J15>$K$52,$I$52+($B$53*(J15-$K$52)),IF(J15>$K$51,$I$51+($B$52*(J15-$K$51)),IF(J15>$K$50,$I$50+($B$51*(J15-$K$50)),$B$50*J15)))))))))))-MIN(J15*$A$35,$B$63)-MIN(J15*$A$29,$B$65),J9)*Input!$E$23)","v":0},{"$f":"IF(K15<0.01,0,IF(Input!$E$23>0,IF(K15<0.01,0,IF(K15>$K$59,$I$59+($B$60*(K15-$K$59)),IF(K15>$K$58,$I$58+($B$59*(K15-$K$58)),IF(K15>$K$57,$I$57+($B$58*(K15-$K$57)),IF(K15>$K$56, $I$56+($B$57*(K15-$K$56)),IF(K15>$K$55,$I$55+($B$56*(K15-$K$55)),IF(K15>$K$54,$I$54+($B$55*(K15-$K$54)),IF(K15>$K$53,$I$53+($B$54*(K15-$K$53)),IF(K15>$K$52,$I$52+($B$53*(K15-$K$52)),IF(K15>$K$51,$I$51+($B$52*(K15-$K$51)),IF(K15>$K$50,$I$50+($B$51*(K15-$K$50)),$B$50*K15)))))))))))-MIN(K15*$A$35,$B$63)-MIN(K15*$A$29,$B$65),K9)*Input!$E$23)","v":0},{"$f":"IF(L15<0.01,0,IF(Input!$E$23>0,IF(L15<0.01,0,IF(L15>$K$59,$I$59+($B$60*(L15-$K$59)),IF(L15>$K$58,$I$58+($B$59*(L15-$K$58)),IF(L15>$K$57,$I$57+($B$58*(L15-$K$57)),IF(L15>$K$56, $I$56+($B$57*(L15-$K$56)),IF(L15>$K$55,$I$55+($B$56*(L15-$K$55)),IF(L15>$K$54,$I$54+($B$55*(L15-$K$54)),IF(L15>$K$53,$I$53+($B$54*(L15-$K$53)),IF(L15>$K$52,$I$52+($B$53*(L15-$K$52)),IF(L15>$K$51,$I$51+($B$52*(L15-$K$51)),IF(L15>$K$50,$I$50+($B$51*(L15-$K$50)),$B$50*L15)))))))))))-MIN(L15*$A$35,$B$63)-MIN(L15*$A$29,$B$65),L9)*Input!$E$23)","v":0},{"$f":"IF(M15<0.01,0,IF(Input!$E$23>0,IF(M15<0.01,0,IF(M15>$K$59,$I$59+($B$60*(M15-$K$59)),IF(M15>$K$58,$I$58+($B$59*(M15-$K$58)),IF(M15>$K$57,$I$57+($B$58*(M15-$K$57)),IF(M15>$K$56, $I$56+($B$57*(M15-$K$56)),IF(M15>$K$55,$I$55+($B$56*(M15-$K$55)),IF(M15>$K$54,$I$54+($B$55*(M15-$K$54)),IF(M15>$K$53,$I$53+($B$54*(M15-$K$53)),IF(M15>$K$52,$I$52+($B$53*(M15-$K$52)),IF(M15>$K$51,$I$51+($B$52*(M15-$K$51)),IF(M15>$K$50,$I$50+($B$51*(M15-$K$50)),$B$50*M15)))))))))))-MIN(M15*$A$35,$B$63)-MIN(M15*$A$29,$B$65),M9)*Input!$E$23)","v":0},{"$f":"IF(N15<0.01,0,IF(Input!$E$23>0,IF(N15<0.01,0,IF(N15>$K$59,$I$59+($B$60*(N15-$K$59)),IF(N15>$K$58,$I$58+($B$59*(N15-$K$58)),IF(N15>$K$57,$I$57+($B$58*(N15-$K$57)),IF(N15>$K$56, $I$56+($B$57*(N15-$K$56)),IF(N15>$K$55,$I$55+($B$56*(N15-$K$55)),IF(N15>$K$54,$I$54+($B$55*(N15-$K$54)),IF(N15>$K$53,$I$53+($B$54*(N15-$K$53)),IF(N15>$K$52,$I$52+($B$53*(N15-$K$52)),IF(N15>$K$51,$I$51+($B$52*(N15-$K$51)),IF(N15>$K$50,$I$50+($B$51*(N15-$K$50)),$B$50*N15)))))))))))-MIN(N15*$A$35,$B$63)-MIN(N15*$A$29,$B$65),N9)*Input!$E$23)","v":0},{"$f":"IF(O15<0.01,0,IF(Input!$E$23>0,IF(O15<0.01,0,IF(O15>$K$59,$I$59+($B$60*(O15-$K$59)),IF(O15>$K$58,$I$58+($B$59*(O15-$K$58)),IF(O15>$K$57,$I$57+($B$58*(O15-$K$57)),IF(O15>$K$56, $I$56+($B$57*(O15-$K$56)),IF(O15>$K$55,$I$55+($B$56*(O15-$K$55)),IF(O15>$K$54,$I$54+($B$55*(O15-$K$54)),IF(O15>$K$53,$I$53+($B$54*(O15-$K$53)),IF(O15>$K$52,$I$52+($B$53*(O15-$K$52)),IF(O15>$K$51,$I$51+($B$52*(O15-$K$51)),IF(O15>$K$50,$I$50+($B$51*(O15-$K$50)),$B$50*O15)))))))))))-MIN(O15*$A$35,$B$63)-MIN(O15*$A$29,$B$65),O9)*Input!$E$23)","v":0},{"$f":"IF(P15<0.01,0,IF(Input!$E$23>0,IF(P15<0.01,0,IF(P15>$K$59,$I$59+($B$60*(P15-$K$59)),IF(P15>$K$58,$I$58+($B$59*(P15-$K$58)),IF(P15>$K$57,$I$57+($B$58*(P15-$K$57)),IF(P15>$K$56, $I$56+($B$57*(P15-$K$56)),IF(P15>$K$55,$I$55+($B$56*(P15-$K$55)),IF(P15>$K$54,$I$54+($B$55*(P15-$K$54)),IF(P15>$K$53,$I$53+($B$54*(P15-$K$53)),IF(P15>$K$52,$I$52+($B$53*(P15-$K$52)),IF(P15>$K$51,$I$51+($B$52*(P15-$K$51)),IF(P15>$K$50,$I$50+($B$51*(P15-$K$50)),$B$50*P15)))))))))))-MIN(P15*$A$35,$B$63)-MIN(P15*$A$29,$B$65),P9)*Input!$E$23)","v":0},{"$f":"IF(Q15<0.01,0,IF(Input!$E$23>0,IF(Q15<0.01,0,IF(Q15>$K$59,$I$59+($B$60*(Q15-$K$59)),IF(Q15>$K$58,$I$58+($B$59*(Q15-$K$58)),IF(Q15>$K$57,$I$57+($B$58*(Q15-$K$57)),IF(Q15>$K$56, $I$56+($B$57*(Q15-$K$56)),IF(Q15>$K$55,$I$55+($B$56*(Q15-$K$55)),IF(Q15>$K$54,$I$54+($B$55*(Q15-$K$54)),IF(Q15>$K$53,$I$53+($B$54*(Q15-$K$53)),IF(Q15>$K$52,$I$52+($B$53*(Q15-$K$52)),IF(Q15>$K$51,$I$51+($B$52*(Q15-$K$51)),IF(Q15>$K$50,$I$50+($B$51*(Q15-$K$50)),$B$50*Q15)))))))))))-MIN(Q15*$A$35,$B$63)-MIN(Q15*$A$29,$B$65),Q9)*Input!$E$23)","v":0},{"$f":"IF(R15<0.01,0,IF(Input!$E$23>0,IF(R15<0.01,0,IF(R15>$K$59,$I$59+($B$60*(R15-$K$59)),IF(R15>$K$58,$I$58+($B$59*(R15-$K$58)),IF(R15>$K$57,$I$57+($B$58*(R15-$K$57)),IF(R15>$K$56, $I$56+($B$57*(R15-$K$56)),IF(R15>$K$55,$I$55+($B$56*(R15-$K$55)),IF(R15>$K$54,$I$54+($B$55*(R15-$K$54)),IF(R15>$K$53,$I$53+($B$54*(R15-$K$53)),IF(R15>$K$52,$I$52+($B$53*(R15-$K$52)),IF(R15>$K$51,$I$51+($B$52*(R15-$K$51)),IF(R15>$K$50,$I$50+($B$51*(R15-$K$50)),$B$50*R15)))))))))))-MIN(R15*$A$35,$B$63)-MIN(R15*$A$29,$B$65),R9)*Input!$E$23)","v":0},{"$f":"IF(S15<0.01,0,IF(Input!$E$23>0,IF(S15<0.01,0,IF(S15>$K$59,$I$59+($B$60*(S15-$K$59)),IF(S15>$K$58,$I$58+($B$59*(S15-$K$58)),IF(S15>$K$57,$I$57+($B$58*(S15-$K$57)),IF(S15>$K$56, $I$56+($B$57*(S15-$K$56)),IF(S15>$K$55,$I$55+($B$56*(S15-$K$55)),IF(S15>$K$54,$I$54+($B$55*(S15-$K$54)),IF(S15>$K$53,$I$53+($B$54*(S15-$K$53)),IF(S15>$K$52,$I$52+($B$53*(S15-$K$52)),IF(S15>$K$51,$I$51+($B$52*(S15-$K$51)),IF(S15>$K$50,$I$50+($B$51*(S15-$K$50)),$B$50*S15)))))))))))-MIN(S15*$A$35,$B$63)-MIN(S15*$A$29,$B$65),S9)*Input!$E$23)","v":0}]
[null,"Individual Tax Payable:Before",{"$f":"IF(Input!$E$23>0,C16/Input!$E$23,C9)","v":1783.3445000000006},null,{"$f":"IF(Input!$E$23>0,E16/Input!$E$23,E9)","v":0},{"$f":"IF(Input!$E$23>0,F16/Input!$E$23,F9)","v":0},{"$f":"IF(Input!$E$23>0,G16/Input!$E$23,G9)","v":0},{"$f":"IF(Input!$E$23>0,H16/Input!$E$23,H9)","v":0},{"$f":"IF(Input!$E$23>0,I16/Input!$E$23,I9)","v":0},{"$f":"IF(Input!$E$23>0,J16/Input!$E$23,J9)","v":0},{"$f":"IF(Input!$E$23>0,K16/Input!$E$23,K9)","v":0},{"$f":"IF(Input!$E$23>0,L16/Input!$E$23,L9)","v":0},{"$f":"IF(Input!$E$23>0,M16/Input!$E$23,M9)","v":0},{"$f":"IF(Input!$E$23>0,N16/Input!$E$23,N9)","v":0},{"$f":"IF(Input!$E$23>0,O16/Input!$E$23,O9)","v":0},{"$f":"IF(Input!$E$23>0,P16/Input!$E$23,P9)","v":0},{"$f":"IF(Input!$E$23>0,Q16/Input!$E$23,Q9)","v":0},{"$f":"IF(Input!$E$23>0,R16/Input!$E$23,R9)","v":0},{"$f":"IF(Input!$E$23>0,S16/Input!$E$23,S9)","v":0}]
[]
["Corporations ( Based on Fed - Prov. Combined Rates for Canadian Controlled Corporations with less than $10 million taxable capital)"]
[]
{"$rows_left_out":51}
{"sheet":"CCA Rate Table","index":6,"n_rows":79,"n_cols":5,"rows_kept":79,"cut":false,"hidden":false,"merged":[]}
["Capital Cost Allowance (CCA) rates"]
["In this list, you will find the more common depreciable properties a farming business may use. The CCA rates appear at the end"]
["of the list. For information on the CCA rates for Class 13, Class 14, Class 34, Class 43.1, and Part XVII of the Income Tax Act,"]
["call 1-800-959-5525."]
[]
["Depreciable property","Class No.",null,"Depreciable property","Class No."]
["Aircraft – Acquired before May 26, 1976 ",16,null,"Hay balers and stookers"]
["Aircraft – Acquired after May 25, 1976 ",9,null,"Drawn ",8]
["Bee equipment ",8,null,"Self-propelled",10]
["Boats and component parts ",7,null,"Hay loaders ",8]
["Breakwater",null,null,"Ice machines ",8]
["Cement or stone ",3,null,"Incubators ",8]
["Wood ",6,null,"Irrigation equipment – Overhead ",8]
["Brooders ",8,null,"Irrigation ponds ",6]
["Buildings and component parts",null,null,"Leasehold interest ",13]
["Wood, galvanized, or portable ",6,null,"Manure spreaders ",8]
["Other:",null,null,"Milking machines ",8]
["Acquired after 1978 and before 1988* ",3,null,"Mixers ",8]
["Acquired after 1987 ",1,null,"Mowers ",8]
["Fruit and vegetable storage (after Feb. 19, 1973) ",8,null,"Nets ",8]
{"$rows_left_out":59}