{"text_format":"1","workbook":"xlsx","n_sheets":8,"sheets":["Menu","RevenueCostInput","Farm Financial Analyzer","Farm Financial Planner","Definitions","CommodityList","Benchmarks","BenchmarksLookup"],"not_rendered":{"charts":0,"images":2,"macros":1,"external_links":0,"defined_names":8,"comments":6,"pivot_tables":0},"unopened":[],"bounds":{"document_bytes":16777216,"sheet_cells":100000,"rows_first":2000,"rows_last":500,"rows_between":2000,"halvings":0,"cell_chars":16384,"cell_head_chars":4096},"cells_cut":0,"cells_raw":0,"read":"whole","date_system":"1900"}

{"sheet":"Menu","index":0,"n_rows":25,"n_cols":1,"rows_kept":25,"cut":false,"hidden":false,"merged":[[28,0,28,2]]}
["This is a farm business decision calculator that has 5 worksheets. There are fields that can be completed by the user. It is up to 10 columns wide and 125 rows."]
["Welcome to the Farm Financial Analyzer Menu Page"]
[]
[]
[]
[]
[]
[]
[]
[]
[]
[]
[]
[]
["The OMAFA Farm Financial Analyzer is a farm analysis program designed to measure profitability and financial efficiency. The program allows you to enter financial information from your income tax statement and uses it to analyse your business performance. Your farm business can be compared with benchmark information from farms who have participated in the Ontario Business Risk Management Programs.  A farm financial planner section allows you to see the results of changing revenue and expenses."]
{"$rows_left_out":11}
{"sheet":"RevenueCostInput","index":1,"n_rows":122,"n_cols":23,"rows_kept":122,"cut":false,"hidden":false,"merged":[]}
["This is a farm business decision calculator that has 5 worksheets. There are fields that can be completed by the user. It is up to 10 columns wide and 125 rows."]
[null,"T1163, Statement A, Statement of Farming Activities","Year:"]
[null,"Business name"]
[null,"Income",null,null,null,null,"Farm type:"]
[null,"Commodity sales","Code","Amount","% allocated to Farm Type"]
[null,null,{"$f":"CommodityList!A6","v":""},null,1,null,{"$f":"D6*E6","v":0},null,null,null,null,null,null,null,null,null,null,null,null,null,null,null,"Beef cow calf"]
[null,null,{"$f":"CommodityList!A7","v":""},null,1,null,0,null,null,null,null,null,null,null,null,null,null,null,null,null,null,null,"Beef feedlot"]
[null,null,{"$f":"CommodityList!A8","v":""},null,1,null,0,null,null,null,null,null,null,null,null,null,null,null,null,null,null,null,"Sheep"]
[null,null,{"$f":"CommodityList!A9","v":""},null,1,null,0,null,null,null,null,null,null,null,null,null,null,null,null,null,null,null,"Swine Farrow to Finish"]
[null,null,{"$f":"CommodityList!A10","v":""},null,1,null,0,null,null,null,null,null,null,null,null,null,null,null,null,null,null,null,"Swine Finishing"]
[null,null,{"$f":"CommodityList!A11","v":""},null,1,null,0,null,null,null,null,null,null,null,null,null,null,null,null,null,null,null,"Dairy Goat"]
[null,null,{"$f":"CommodityList!A12","v":""},null,1,null,0,null,null,null,null,null,null,null,null,null,null,null,null,null,null,null,"Apple"]
[null,null,{"$f":"CommodityList!A13","v":""},null,1,null,0,null,null,null,null,null,null,null,null,null,null,null,null,null,null,null,"Greenhouse cucumber"]
[null,null,{"$f":"CommodityList!A14","v":""},null,1,null,0,null,null,null,null,null,null,null,null,null,null,null,null,null,null,null,"Greenhouse pepper"]
[null,null,{"$f":"CommodityList!A15","v":""},null,1,null,0,null,null,null,null,null,null,null,null,null,null,null,null,null,null,null,"Greenhouse tomato"]
{"$rows_left_out":108}
{"sheet":"Farm Financial Analyzer","index":2,"n_rows":36,"n_cols":29,"rows_kept":36,"cut":false,"hidden":false,"merged":[]}
["This is a farm business decision calculator that has 5 worksheets. There are fields that can be completed by the user. It is up to 10 columns wide and 125 rows."]
["Farm Financial Analyzer"]
[null,null,null,null,"Select the farm type comparison:"]
[null,null,null,null,"No benchmark"]
[{"$f":"RevenueCostInput!B3","v":"Business name"},null,{"$f":"RevenueCostInput!D2","v":0},null,"Benchmark comparison (2017 to 2021)",null,null,null,null,null,null,null,null,null,null,null,null,null,null,null,null,null,"Farm types",null,null,null,null,{"$f":"E4","v":"No benchmark"}]
[null,null,"Your Farm","Your Farm",{"$f":"E4","v":"No benchmark"},null,null,null,null,null,null,null,null,null,null,null,null,null,null,null,null,null,"Beef cow calf"]
[null,null,{"$f":"IF(RevenueCostInput!G5=0,\"\",RevenueCostInput!G5)","v":""},null,"All","Top",null,null,null,null,null,null,null,null,null,null,null,null,null,null,null,null,"Beef feedlot"]
[null,"Financial Measures","Total $","$ of Revenue from farming operations",null,null,null,null,null,null,null,null,null,null,null,null,null,null,null,null,null,null,"Sheep",null,null,null,null,"All","Top"]
["$","Revenue from farming operations",{"$f":"SUM(RevenueCostInput!G6:G30,RevenueCostInput!G114,RevenueCostInput!G115)","v":0},{"$f":"IFERROR(C9/$C$9,\"\")","v":""},{"$f":"IFERROR(AB9,\"\")","v":""},{"$f":"IFERROR(AC9,\"\")","v":""},null,null,null,null,null,null,null,null,null,null,null,null,null,null,null,null,"Swine Farrow to Finish",null,null,null,"Revenue from farming operations",{"$f":"HLOOKUP($AB$5,BenchmarksLookup!$C$6:$O$32,5,FALSE)","v":{"$error":"#N/A"}},{"$f":"HLOOKUP($AB$5,topbench,5,FALSE)","v":{"$error":"#N/A"}}]
["$","Cost of goods sold",{"$f":"SUM(RevenueCostInput!G54:G71,RevenueCostInput!G73,RevenueCostInput!G74,RevenueCostInput!G75,RevenueCostInput!G76,RevenueCostInput!G77,RevenueCostInput!G84,RevenueCostInput!G85,RevenueCostInput!G116)-RevenueCostInput!G117","v":0},{"$f":"IFERROR(C10/$C$9,\"\")","v":""},{"$f":"IFERROR(AB10,\"\")","v":""},"",null,null,null,null,null,null,null,null,null,null,null,null,null,null,null,null,"Swine Finishing",null,null,null,"Cost of goods sold",{"$f":"HLOOKUP($AB$5,BenchmarksLookup!$C$6:$O$32,6,FALSE)","v":{"$error":"#N/A"}},{"$f":"HLOOKUP($AB$5,topbench,6,FALSE)","v":{"$error":"#N/A"}}]
["$","Gross Margin",{"$f":"C9-C10","v":0},"","","",null,null,null,null,null,null,null,null,null,null,null,null,null,null,null,null,"Dairy Goat",null,null,null,"Gross Margin",{"$f":"HLOOKUP($AB$5,BenchmarksLookup!$C$6:$O$32,7,FALSE)","v":{"$error":"#N/A"}},{"$f":"HLOOKUP($AB$5,topbench,7,FALSE)","v":{"$error":"#N/A"}}]
["$","Direct Operating Expenses",{"$f":"SUM(RevenueCostInput!G78,RevenueCostInput!G82,RevenueCostInput!G99,RevenueCostInput!G82,RevenueCostInput!G72,RevenueCostInput!G86,RevenueCostInput!G91,RevenueCostInput!G101,RevenueCostInput!G89,RevenueCostInput!G102,RevenueCostInput!G80,RevenueCostInput!G100,RevenueCostInput!G79,RevenueCostInput!G81,RevenueCostInput!G107)","v":0},"","","",null,null,null,null,null,null,null,null,null,null,null,null,null,null,null,null,"Apple",null,null,null,"Direct Operating Expenses",{"$f":"HLOOKUP($AB$5,BenchmarksLookup!$C$6:$O$32,8,FALSE)","v":{"$error":"#N/A"}},{"$f":"HLOOKUP($AB$5,topbench,8,FALSE)","v":{"$error":"#N/A"}}]
["$","Contribution Margin",{"$f":"C11-C12","v":0},"","","",null,null,null,null,null,null,null,null,null,null,null,null,null,null,null,null,"Greenhouse cucumber",null,null,null,"Contribution Margin",{"$f":"HLOOKUP($AB$5,BenchmarksLookup!$C$6:$O$32,9,FALSE)","v":{"$error":"#N/A"}},{"$f":"HLOOKUP($AB$5,topbench,9,FALSE)","v":{"$error":"#N/A"}}]
["$","Operating Overhead Expenses",{"$f":"SUM(RevenueCostInput!G92,RevenueCostInput!G88,RevenueCostInput!G94,RevenueCostInput!G95,RevenueCostInput!G96,RevenueCostInput!G103,RevenueCostInput!G104,RevenueCostInput!G110)","v":0},"","","",null,null,null,null,null,null,null,null,null,null,null,null,null,null,null,null,"Greenhouse pepper",null,null,null,"Operating Overhead Expenses",{"$f":"HLOOKUP($AB$5,BenchmarksLookup!$C$6:$O$32,10,FALSE)","v":{"$error":"#N/A"}},{"$f":"HLOOKUP($AB$5,topbench,10,FALSE)","v":{"$error":"#N/A"}}]
["$","EBITDAR ",{"$f":"C13-C14","v":0},"","","",null,null,null,null,null,null,null,null,null,null,null,null,null,null,null,null,"Greenhouse tomato",null,null,null,"EBITDAR ",{"$f":"HLOOKUP($AB$5,BenchmarksLookup!$C$6:$O$32,11,FALSE)","v":{"$error":"#N/A"}},{"$f":"HLOOKUP($AB$5,topbench,11,FALSE)","v":{"$error":"#N/A"}}]
{"$rows_left_out":22}
{"sheet":"Farm Financial Planner","index":3,"n_rows":34,"n_cols":28,"rows_kept":34,"cut":false,"hidden":false,"merged":[]}
["This is a farm business decision calculator that has 5 worksheets. There are fields that can be completed by the user. It is up to 10 columns wide and 125 rows."]
["Farm Financial Planner"]
[]
[{"$f":"RevenueCostInput!B3","v":"Business name"},null,{"$f":"RevenueCostInput!D2","v":0},null,null,null,null,"Farm type comparison:"]
[null,null,"Your Farm","Your Farm","Sales unit",null,null,{"$f":"'Farm Financial Analyzer'!E6","v":"No benchmark"}]
[null,null,null,null,"Quantity marketed",null,{"$f":"F5","v":0},"All","Top"]
[null,null,{"$f":"IF(RevenueCostInput!G5=0,\"\",RevenueCostInput!G5)","v":""},null,"Price",null,{"$f":"\"per \"&F5","v":"per "}]
[null,"Financial Measures","Total $","$ of Revenue","Total $",{"$f":"\"$ \"&G7","v":"$ per "},null,{"$f":"\"$ \"&G7","v":"$ per "},{"$f":"\"$ \"&G7","v":"$ per "},null,null,null,null,null,null,null,null,null,null,null,null,null,null,null,null,null,"all","top"]
["$","Revenue from farming operations",{"$f":"SUM(RevenueCostInput!G6:G30,RevenueCostInput!G114,RevenueCostInput!G115)","v":0},{"$f":"IFERROR(C9/$C$9,\"\")","v":""},{"$f":"F6*F7","v":0},{"$f":"IFERROR(E9/$F$6,\"\")","v":""},null,{"$f":"IFERROR(AA9/$F$6,\"\")","v":""},{"$f":"IFERROR(AB9/$F$6,\"\")","v":""},null,null,null,null,null,null,null,null,null,null,null,null,null,null,null,null,null,{"$f":"E9","v":0},{"$f":"AA9","v":0}]
["$","Cost of goods sold",{"$f":"SUM(RevenueCostInput!G54:G71,RevenueCostInput!G73,RevenueCostInput!G74,RevenueCostInput!G75,RevenueCostInput!G76,RevenueCostInput!G77,RevenueCostInput!G84,RevenueCostInput!G85,RevenueCostInput!G116)-RevenueCostInput!G117","v":0},{"$f":"IFERROR(C10/$C$9,\"\")","v":""},{"$f":"IFERROR($E$9*D10,\"\")","v":""},{"$f":"IFERROR(E10/$F$6,\"\")","v":""},null,{"$f":"IFERROR(AA10/$F$6,\"\")","v":""},{"$f":"IFERROR(AB10/$F$6,\"\")","v":""},null,null,null,null,null,null,null,null,null,null,null,null,null,null,null,null,null,{"$f":"IFERROR($AA$9*'Farm Financial Analyzer'!E10,\"\")","v":""},{"$f":"IFERROR($AB$9*'Farm Financial Analyzer'!F10,\"\")","v":""}]
["$","Gross Margin",{"$f":"C9-C10","v":0},"",{"$f":"IFERROR($E$9*D11,\"\")","v":""},"",null,"","",null,null,null,null,null,null,null,null,null,null,null,null,null,null,null,null,null,{"$f":"IFERROR($AA$9*'Farm Financial Analyzer'!E11,\"\")","v":""},{"$f":"IFERROR($AB$9*'Farm Financial Analyzer'!F11,\"\")","v":""}]
["$","Direct Operating Expenses",{"$f":"SUM(RevenueCostInput!G78,RevenueCostInput!G82,RevenueCostInput!G99,RevenueCostInput!G82,RevenueCostInput!G72,RevenueCostInput!G86,RevenueCostInput!G91,RevenueCostInput!G101,RevenueCostInput!G89,RevenueCostInput!G102,RevenueCostInput!G80,RevenueCostInput!G100,RevenueCostInput!G79,RevenueCostInput!G81,RevenueCostInput!G107)","v":0},"","","",null,"","",null,null,null,null,null,null,null,null,null,null,null,null,null,null,null,null,null,{"$f":"IFERROR($AA$9*'Farm Financial Analyzer'!E12,\"\")","v":""},{"$f":"IFERROR($AB$9*'Farm Financial Analyzer'!F12,\"\")","v":""}]
["$","Contribution Margin",{"$f":"C11-C12","v":0},"","","",null,"","",null,null,null,null,null,null,null,null,null,null,null,null,null,null,null,null,null,{"$f":"IFERROR($AA$9*'Farm Financial Analyzer'!E13,\"\")","v":""},{"$f":"IFERROR($AB$9*'Farm Financial Analyzer'!F13,\"\")","v":""}]
["$","Operating Overhead Expenses",{"$f":"SUM(RevenueCostInput!G92,RevenueCostInput!G88,RevenueCostInput!G94,RevenueCostInput!G95,RevenueCostInput!G96,RevenueCostInput!G103,RevenueCostInput!G104,RevenueCostInput!G110)","v":0},"","","",null,"","",null,null,null,null,null,null,null,null,null,null,null,null,null,null,null,null,null,{"$f":"IFERROR($AA$9*'Farm Financial Analyzer'!E14,\"\")","v":""},{"$f":"IFERROR($AB$9*'Farm Financial Analyzer'!F14,\"\")","v":""}]
["$","EBITDAR ",{"$f":"C13-C14","v":0},"","","",null,"","",null,null,null,null,null,null,null,null,null,null,null,null,null,null,null,null,null,{"$f":"IFERROR($AA$9*'Farm Financial Analyzer'!E15,\"\")","v":""},{"$f":"IFERROR($AB$9*'Farm Financial Analyzer'!F15,\"\")","v":""}]
{"$rows_left_out":20}
{"sheet":"Definitions","index":4,"n_rows":126,"n_cols":5,"rows_kept":126,"cut":false,"hidden":false,"merged":[]}
["This is a farm business decision calculator that has 5 worksheets. There are fields that can be completed by the user. It is up to 10 columns wide and 125 rows."]
["Ontario Farm Financial Analysis Summary"]
["Standardized Financial Reporting and Benchmarks*"]
["The Ontario Farm Financial Summary results and benchmarks use a standardized financial reporting format. "]
["Expenses are grouped into 5 main categories for the analysis to enable comparison within and across farm types. "]
["The definitions of the expense categories, financial measures and ratios are presented below."]
["Revenue and Expense Categories"]
[null,null,"Calculation includes:",null,"Adjustments"]
["Revenue from farming operations","+","Commodity sales","+","Change in inventory"]
[null,"+","Crop insurance payments","+","Change in accounts receivable "]
["Cost of goods sold","+","Commodity purchases (crops, seed, feed, livestock)","+","Change in accounts payable"]
[null,"+","Fertilizers and soil supplements","-","Change in purchased inputs"]
[null,"+","Pesticides and chemical treatments"]
[null,"+","Insurance premiums (crop or production)"]
[null,"+","Private insurance premiums for allowable commodities"]
{"$rows_left_out":112}
{"sheet":"CommodityList","index":5,"n_rows":327,"n_cols":6,"rows_kept":327,"cut":false,"hidden":true,"merged":[]}
[null,"Commodity list",null,null,"Program payments list"]
[null,"Barley",3,null,"AgriRecovery drought assistance payments (allowable)",774]
[null,"Beans (dry edible)",4,null,"Canadian Food Inspection Agency (CFIA) payment for allowable commodities",663]
[null,"Borage",6,null,"Canadian Food Inspection Agency (CFIA) payment for other amounts",665]
[null,"Buckwheat",7,null,"Canadian Food Inspection Agency (CFIA) payment for supply managed commodities",664]
[{"$f":"IF(RevenueCostInput!B6<>0,VLOOKUP(RevenueCostInput!B6,$B$2:$C$331,2,FALSE),\"\")","v":""},"Camelina",282,null,"COVID-19 – AgriRecovery – Livestock set aside programs",699]
[{"$f":"IF(RevenueCostInput!B7<>0,VLOOKUP(RevenueCostInput!B7,$B$2:$C$331,2,FALSE),\"\")","v":""},"Canadian Wheat Board payments",2,null,"COVID-19 – Other assistance payments (allowable income)",687]
[{"$f":"IF(RevenueCostInput!B8<>0,VLOOKUP(RevenueCostInput!B8,$B$2:$C$331,2,FALSE),\"\")","v":""},"Canary seed",8,null,"COVID-19 – Temporary foreign worker subsidy payments",686]
[{"$f":"IF(RevenueCostInput!B9<>0,VLOOKUP(RevenueCostInput!B9,$B$2:$C$331,2,FALSE),\"\")","v":""},"Canola",10,null,"COVID-19 – Wage subsidy payments for arm’s length salaries",684]
[{"$f":"IF(RevenueCostInput!B10<>0,VLOOKUP(RevenueCostInput!B10,$B$2:$C$331,2,FALSE),\"\")","v":""},"Chick peas/Garbanzo beans",23,null,"Crop cover protection program",473]
[{"$f":"IF(RevenueCostInput!B11<>0,VLOOKUP(RevenueCostInput!B11,$B$2:$C$331,2,FALSE),\"\")","v":""},"Corn",11,null,"Cull breeding swine program (all provinces)",582]
[{"$f":"IF(RevenueCostInput!B12<>0,VLOOKUP(RevenueCostInput!B12,$B$2:$C$331,2,FALSE),\"\")","v":""},"Faba beans",12,null,"Dairy Direct Payment Program (DDPP)",683]
[{"$f":"IF(RevenueCostInput!B13<>0,VLOOKUP(RevenueCostInput!B13,$B$2:$C$331,2,FALSE),\"\")","v":""},"Field peas",13,null,"Livestock feed insurance program",412]
[{"$f":"IF(RevenueCostInput!B14<>0,VLOOKUP(RevenueCostInput!B14,$B$2:$C$331,2,FALSE),\"\")","v":""},"Flaxseed",14,null,"Livestock price insurance",667]
[{"$f":"IF(RevenueCostInput!B15<>0,VLOOKUP(RevenueCostInput!B15,$B$2:$C$331,2,FALSE),\"\")","v":""},"Forage (including pellets, silage)",264,null,"Other AgriRecovery program (allowable income)*",627]
{"$rows_left_out":313}
{"sheet":"Benchmarks","index":6,"n_rows":32,"n_cols":28,"rows_kept":32,"cut":false,"hidden":true,"merged":[]}
[null,null,"Ontario Farm Financial Analysis Summary"]
[null,null,"Benchmark Summary"]
["The Ontario Farm Financial Data Summary uses farm income and expense data to evaluate financial performance based on farm type."]
["The income and expense data used comes from selected Ontario farm businesses participating in business risk management programs."]
["Financial Measure and Ratio values are the median of the sample."]
[null,"Farm types","Beef cow calf",null,"Beef feedlot",null,"Sheep",null,"Swine Farrow to Finish",null,"Swine Finishing",null,"Dairy Goat",null,"Apple",null,"Greenhouse cucumber",null,"Greenhouse pepper",null,"Greenhouse tomato",null,"Greenhouse flower",null,"Field crops",null,"Grapes"]
[null,null,"All","Top","All","Top","All","Top","All","Top","All","Top","All","Top","All","Top","All","Top","All","Top","All","Top","All","Top","All","Top","All","Top"]
[]
[null,"Financial Measures","$ of Revenue from farming operations"]
["$","Revenue from farming operations",1,1,1,1,1,1,1,1,1,1,1,1,1,1,1,1,1,1,1,1,1,1,1,1,1,1]
["$","Cost of goods sold",0.41054322048141023,0.32465948738237743,0.83298910081486954,0.73284424872875598,0.43258170504638283,0.35108599739127305,0.56409673649316161,0.47313055502473278,0.74346721653903414,0.63169181781175232,0.32155577272924657,0.24919819000849575,0.17227672107472347,0.15248901630236761,0.24844070241137622,0.20370462113282453,0.16974899547608441,0.15478559971137659,0.15909187677357908,0.12503987823974511,0.22754784167492748,0.19616313444643377,0.33635339950437304,0.28402107111501318,0.16109616818347694,0.10523021329579904]
["$","Gross Margin",0.58945677951858977,0.67534051261762262,0.16701089918513046,0.26715575127124402,0.56741829495361717,0.648914002608727,0.43590326350683839,0.52686944497526722,0.25653278346096586,0.36830818218824768,0.67844422727075337,0.75080180999150425,0.82772327892527653,0.84751098369763245,0.75155929758862383,0.7962953788671755,0.83025100452391554,0.84521440028862338,0.84090812322642094,0.87496012176025495,0.77245215832507252,0.80383686555356626,0.66364660049562696,0.71597892888498682,0.83890383181652306,0.89476978670420093]
["$","Direct Operating Expenses",0.32210125026589898,0.23749535082250378,9.1204577224264283E-2,7.4343315293830578E-2,0.39870402865289478,0.29336747526406404,0.18571737671084679,0.15163500327283028,0.12868660910150839,9.335534734154928E-2,0.23011508750151069,0.16896188474476509,0.61822216844085076,0.42884875449111381,0.59117969833882456,0.53488639852625119,0.55124857983504083,0.45728925560343858,0.63775803990117197,0.54046172747923271,0.54850587051626409,0.46493025915866465,0.20257964874175249,0.13137529362551084,0.62320472899692603,0.39921290559738032]
["$","Contribution Margin",0.26735552925269079,0.43784516179511884,7.5806321960866174E-2,0.19281243597741343,0.16871426630072239,0.35554652734466297,0.25018588679599163,0.37523444170243692,0.12784617435945747,0.27495283484669841,0.44832913976924271,0.58183992524673922,0.20950111048442577,0.41866222920651863,0.16037959924979928,0.2614089803409243,0.27900242468887471,0.3879251446851848,0.20315008332524898,0.33449839428102224,0.22394628780880843,0.33890660639490161,0.46106695175387447,0.58460363525947601,0.21569910281959703,0.49555688110682061]
["$","Operating Overhead Expenses",8.1253536557469808E-2,5.7109255552026374E-2,2.0436060658621635E-2,1.445484977679993E-2,9.135963231089067E-2,7.6875202706848639E-2,2.6243693550492393E-2,2.2285286147858175E-2,1.6493838467455984E-2,1.4373798098382422E-2,5.0527533400508667E-2,2.9536912420195599E-2,5.5097733127391087E-2,4.1084430883700229E-2,3.5709180305880772E-2,3.0496343865178101E-2,3.5552877234478836E-2,2.7519039681480853E-2,3.6299106649081189E-2,3.1834305266038573E-2,6.454157724819376E-2,5.3783914291210454E-2,5.3621500005082215E-2,3.9790738911848735E-2,9.6133179773557648E-2,4.4774672569776304E-2]
{"$rows_left_out":18}
{"sheet":"BenchmarksLookup","index":7,"n_rows":32,"n_cols":28,"rows_kept":32,"cut":false,"hidden":true,"merged":[]}
[null,null,"Ontario Farm Financial Analysis Summary"]
[null,null,"Benchmark Summary"]
["The Ontario Farm Financial Data Summary uses farm income and expense data to evaluate financial performance based on farm type."]
["The income and expense data used comes from selected Ontario farm businesses participating in business risk management programs."]
["Financial Measure and Ratio values are the median of the sample."]
[null,"Farm types","Beef cow calf","Beef feedlot","Sheep","Swine Farrow to Finish","Swine Finishing","Dairy Goat","Apple","Greenhouse cucumber","Greenhouse pepper","Greenhouse tomato","Greenhouse flower","Field crops","Grapes","Beef cow calf","Beef feedlot","Sheep","Swine Farrow to Finish","Swine Finishing","Dairy Goat","Apple","Greenhouse cucumber","Greenhouse pepper","Greenhouse tomato","Greenhouse flower","Field crops","Grapes"]
[null,null,"All","All","All","All","All","All","All","All","All","All","All","All","All","Top","Top","Top","Top","Top","Top","Top","Top","Top","Top","Top","Top","Top"]
[]
[null,"Financial Measures","$ of Revenue from farming operations"]
["$","Revenue from farming operations",1,1,1,1,1,1,1,1,1,1,1,1,1,1,1,1,1,1,1,1,1,1,1,1,1,1]
["$","Cost of goods sold",0.41054322048141023,0.83298910081486954,0.43258170504638283,0.56409673649316161,0.74346721653903414,0.32155577272924657,0.17227672107472347,0.24844070241137622,0.16974899547608441,0.15909187677357908,0.22754784167492748,0.33635339950437304,0.16109616818347694,0.32465948738237743,0.73284424872875598,0.35108599739127305,0.47313055502473278,0.63169181781175232,0.24919819000849575,0.15248901630236761,0.20370462113282453,0.15478559971137659,0.12503987823974511,0.19616313444643377,0.28402107111501318,0.10523021329579904]
["$","Gross Margin",0.58945677951858977,0.16701089918513046,0.56741829495361717,0.43590326350683839,0.25653278346096586,0.67844422727075337,0.82772327892527653,0.75155929758862383,0.83025100452391554,0.84090812322642094,0.77245215832507252,0.66364660049562696,0.83890383181652306,0.67534051261762262,0.26715575127124402,0.648914002608727,0.52686944497526722,0.36830818218824768,0.75080180999150425,0.84751098369763245,0.7962953788671755,0.84521440028862338,0.87496012176025495,0.80383686555356626,0.71597892888498682,0.89476978670420093]
["$","Direct Operating Expenses",0.32210125026589898,9.1204577224264283E-2,0.39870402865289478,0.18571737671084679,0.12868660910150839,0.23011508750151069,0.61822216844085076,0.59117969833882456,0.55124857983504083,0.63775803990117197,0.54850587051626409,0.20257964874175249,0.62320472899692603,0.23749535082250378,7.4343315293830578E-2,0.29336747526406404,0.15163500327283028,9.335534734154928E-2,0.16896188474476509,0.42884875449111381,0.53488639852625119,0.45728925560343858,0.54046172747923271,0.46493025915866465,0.13137529362551084,0.39921290559738032]
["$","Contribution Margin",0.26735552925269079,7.5806321960866174E-2,0.16871426630072239,0.25018588679599163,0.12784617435945747,0.44832913976924271,0.20950111048442577,0.16037959924979928,0.27900242468887471,0.20315008332524898,0.22394628780880843,0.46106695175387447,0.21569910281959703,0.43784516179511884,0.19281243597741343,0.35554652734466297,0.37523444170243692,0.27495283484669841,0.58183992524673922,0.41866222920651863,0.2614089803409243,0.3879251446851848,0.33449839428102224,0.33890660639490161,0.58460363525947601,0.49555688110682061]
["$","Operating Overhead Expenses",8.1253536557469808E-2,2.0436060658621635E-2,9.135963231089067E-2,2.6243693550492393E-2,1.6493838467455984E-2,5.0527533400508667E-2,5.5097733127391087E-2,3.5709180305880772E-2,3.5552877234478836E-2,3.6299106649081189E-2,6.454157724819376E-2,5.3621500005082215E-2,9.6133179773557648E-2,5.7109255552026374E-2,1.445484977679993E-2,7.6875202706848639E-2,2.2285286147858175E-2,1.4373798098382422E-2,2.9536912420195599E-2,4.1084430883700229E-2,3.0496343865178101E-2,2.7519039681480853E-2,3.1834305266038573E-2,5.3783914291210454E-2,3.9790738911848735E-2,4.4774672569776304E-2]
{"$rows_left_out":17}