{"text_format":"1","workbook":"xlsx","n_sheets":5,"sheets":["Guide","Configuration","Transport et abattage","Coût de transformation","Produits et marges "],"not_rendered":{"charts":0,"images":0,"macros":1,"external_links":0,"defined_names":1,"comments":0,"pivot_tables":0},"unopened":[],"bounds":{"document_bytes":16777216,"sheet_cells":100000,"rows_first":2000,"rows_last":500,"rows_between":2000,"halvings":0,"cell_chars":16384,"cell_head_chars":4096},"cells_cut":0,"cells_raw":0,"read":"whole","date_system":"1900"}

{"sheet":"Guide","index":0,"n_rows":63,"n_cols":2,"rows_kept":63,"cut":false,"hidden":false,"merged":[]}
["Ceci est une calculatrice d'aide aux décisions d'affaire à la ferme qui comporte 5 feuilles de travail. Certains champs doivent être remplis par l'utilisateur. Elle peut avoir 14 colonnes de largeur et 35 rangées."]
[null,"Analyse de rendement - Vente directe des produits de la ferme : outil de calcul des coûts de transformation de la viandes"]
[null,"Préparé par :  Andreas Boecker, Braden Kemp"]
[null,"Date : 25/07/2011"]
[null,"Dernière mise à jour :  30/11/2012"]
[]
[null,"Ce projet a été financé dans le cadre de Cultivons l'avenir, une initiative fédérale-provinciale-territoriale "]
[]
[null,"Légende des couleurs des cellules"]
[null,"Cellules du logiciel :  ne pas modifier "]
[null,"Résultat calculé, outils de planification : ne pas modifier "]
[null,"Cellule de saisie des données : entrer les données "]
[]
[null,"Remarques :"]
[null,"Si un mot de passe est demandé pour permettre de modifier les cellules surlignées en jaune, "]
[null,"le mot de passe pour le classeur est FDM2011 "]
[]
[]
[null,"Guide d'utilisation "]
[null,"Introduction"]
[null,"Ce guide fournit des directives onglet par onglet sur l'utilisation de l'outil de calcul des coûts de transformation de la viande à la ferme.  Ces directives permettront aux utilisateurs d'entrer des données avec une précision suffisante pour obtenir l'information relative à l'analyse des coûts et des marges,  à des fins de planification ou de vérification.  Chaque onglet correspond à une section différente où sera d'abord décrit le but de la section, suivi d'une série de directives concernant la saisie et l'analyse des données. "]
[]
[null,"Onglet «Configuration»"]
[null,"À l'onglet «Configuration», on demande à l'utilisateur d'entrer les catégories de produits ainsi que les unités de poids correspondantes qui seront utilisées dans l'ensemble du classeur.  C'est l'utilisateur qui définit ses catégories de produits. Par exemple, si l'utilisateur produit une seule espèce, disons du dindon, les catégories de produits pourraient être «oiseaux entiers», «parties précieuses», «sous-produits/parties moins précieuses» et  «produits surtransformés/saucisses». Si plus d'une espèce est produite, les catégories de produits peuvent correspondre aux différentes espèces.  Toutefois, lorsqu'à chaque espèce est associée de nombreux produits différents, il est probablement plus efficace d'avoir un classeur par espèce. Il y a assez d'espace pour dix catégories de produits. "]
[null,"Directives"]
[null,"1. Entrez les catégories de produits dans les cellules B5 à  B14."]
[null,"2. Entrez les unités de poids correspondantes des produits qui reviennent de l'abattoir dans les cellules C5 à C14. On présume que les mêmes unités de poids (kilogrammes ou livres) seront aussi utilisées pour les produits commercialisés. Si les unités de poids diffèrent selon les produits d'abattage et les produits commercialisés, il faut alors convertir l'une de ces unités pour uniformiser le tout. "]
[null,""]
[null,"Onglet «Transport et abattage »"]
[null,"Cet onglet permet à l'utilisateur de calculer les coûts de transport ( jusqu'à l'abattoir et, le cas échéant,  les coûts de surtransformation) en $/unité de poids du produit retourné de l'abattoir, pour chacune des catégories, jusqu'à un maximum de dix catégories. L'utilisateur peut avoir recours à diverses sources d'information : "]
[null,"Si les registres sont disponibles pour une certaine période de temps ( un an ou moins), les différentes sections servant à l'entrée des données devraient être regroupées pour cette période. "]
[null,"En l'absence de registres complets, on peut se baser sur des lots types d'animaux  qui ont été expédiés à l'abattoir à titre de données-échantillons. Si les lots sont de taille différente, c'est-à-dire que le nombre d'animaux expédiés est différent, on peut entrer des moyennes d'échantillon. "]
[null,"Quelle que soit la source d'information utilisée, toutes les données entrées sous cet onglet devraient provenir de la même source.  "]
[null,"Directives"]
[null,"1. Le processus commence par la capture et le chargement des animaux.  Entrez le salaire horaire et le nombre total d'heures travaillées aux lignes 4 et 5 respectivement. Si l'équipe responsable du chargement des animaux est composée de trois personnes,  cela fait un total de six heures de travail. Si les membres de l'équipe n'ont pas le même taux de salaire, entrez le taux moyen pour  l'équipe. Si le travail est effectué par des membres de la famille  qui ne sont pas rémunérés sur une base horaire, entrez un taux de salaire de 0$, mais l'utilisateur doit tenir un registre du nombre d'heures travaillées."]
[null,"2. Dans le cas des coûts de  transport relatifs à chacune des catégories de produits saisies à l'onglet «Configuration »,  remplir les colonnes correspondantes, des lignes 6 à 12 et 14. Le coût à la ligne 5 correspond au coûts de transport aller-retour pour l'abattage ou la surtransformation en $ par unité de poids de produit retourné de l'abattoir. "]
[null,"·    Si les animaux sont expédiés par une entreprise de transport ou de camionnage,  entrez le tarif demandé à la ligne 6.  "]
[null,"·    Si vous expédiez vous-même les animaux,  entrez le tarif au km pour le véhicule ( et la remorque) à la ligne 7. Si vous avez utilisé uniquement les coûts directs, soit les dépenses pour l'essence, n'oubliez pas que tous les autres frais pour le véhicule doivent être traités comme des coûts indirects qui doivent figurer dans les coûts variables des produits de votre exploitation. Ici encore, en présence de différents taux de salaire,  on doit calculer ou estimer la moyenne. "]
[null,"·    Si les animaux  sont expédiés par vous-même ou un de vos employés, entrez le taux de salaire approprié.  Si la tâche est effectuée par des membres de la famille, qui ne sont pas rémunérés sur une base horaire, entrez un taux de salaire de 0$, mais l'utilisateur doit tenir un registre du nombre d'heures travaillées."]
[null,"•   Pour ce calcul, les déplacements relatifs à l'abattage et ceux qui s'appliquent à la surtransformation sont énumérés de manière distincte, car le lieu peut être différent.  Les déplacements liés à la transformation incluraient alors un voyage pour ramasser les produits provenant de l'abattoir. Mais, même si l'abattage et la transformation ont lieu au même endroit, deux voyages distincts sont requis, puisque les véhicules qui transportent les animaux ne peuvent pas servir au transport de produits transformés. Finalement, le temps de déplacement comprend le temps consacré au déchargement, au chargement et le temps d'attente à l'abattoir ou à l'usine de transformation.  Les frais de transport représentent un poste important de dépenses dans les ventes directes de viande provenant de la ferme. "]
{"$rows_left_out":24}
{"sheet":"Configuration","index":1,"n_rows":16,"n_cols":5,"rows_kept":16,"cut":false,"hidden":false,"merged":[]}
["Configuration - Catégorie de produit et unité de poids des produits transformés "]
[]
[]
[1,"Catégorie de produit","Unité de poids des produits retournés de l'abattoir","Coût de transport par unité de poids ","Coût d'abattage par unité de poids "]
[2,"Bovin de boucherie","lb",{"$f":"'Transport et abattage'!B15","v":0.16931818181818181},{"$f":"'Transport et abattage'!B18","v":0.12121212121212122}]
[3,"Porc","lb",{"$f":"'Transport et abattage'!C15","v":9.8900000000000002E-2},{"$f":"'Transport et abattage'!C18","v":0.12}]
[4,"Lapin","lb",{"$f":"'Transport et abattage'!D15","v":0.3477777777777778},{"$f":"'Transport et abattage'!D18","v":0.66666666666666663}]
[5,"Dindon","lb",{"$f":"'Transport et abattage'!E15","v":0.13250000000000001},{"$f":"'Transport et abattage'!E18","v":0.6428571428571429}]
[6,null,"lb",{"$f":"'Transport et abattage'!F15","v":"S/O"},{"$f":"'Transport et abattage'!F18","v":"S/O"}]
[7,"-","lb",{"$f":"'Transport et abattage'!G15","v":"S/O"},{"$f":"'Transport et abattage'!G18","v":"S/O"}]
[8,"-","lb",{"$f":"'Transport et abattage'!H15","v":"S/O"},{"$f":"'Transport et abattage'!H18","v":"S/O"}]
[9,"-","lb",{"$f":"'Transport et abattage'!I15","v":"S/O"},{"$f":"'Transport et abattage'!I18","v":"S/O"}]
[10,"-","lb",{"$f":"'Transport et abattage'!J15","v":"S/O"},{"$f":"'Transport et abattage'!J18","v":"S/O"}]
[11,"-","lb",{"$f":"'Transport et abattage'!K15","v":"S/O"},{"$f":"'Transport et abattage'!K18","v":"S/O"}]
[]
["fin de la feuille de calcul"]

{"sheet":"Transport et abattage","index":2,"n_rows":20,"n_cols":11,"rows_kept":20,"cut":false,"hidden":false,"merged":[]}
["Coûts de transport et d'abattage "]
[]
["Transport",{"$f":"Configuration!B5","v":"Bovin de boucherie"},{"$f":"Configuration!B6","v":"Porc"},{"$f":"Configuration!B7","v":"Lapin"},{"$f":"Configuration!B8","v":"Dindon"},{"$f":"Configuration!B9","v":0},{"$f":"Configuration!B10","v":"-"},{"$f":"Configuration!B11","v":"-"},{"$f":"Configuration!B12","v":"-"},{"$f":"Configuration!B13","v":"-"},{"$f":"Configuration!B14","v":"-"}]
["Capture /chargement :       salaire $/h",12,12,12,15]
["                                    Temps total  ",2,2,1,3]
["Transport  des animaux par une entrepirse de camionnage : tarif  ",null,400]
["Transport par le propriétaire de la ferme :  coût/km ",0.55000000000000004,0.55000000000000004,0.55000000000000004,0.55000000000000004]
["                                              Salaire $/h",15,15,15,15]
["Distance parcourue pour l'abattage (en km)",120,30,70,80]
["Durée du déplacement associé à l'abattage (h)",2,1,2,1.5]
["Distance parcourue jusqu'à l'usine de transformation  (en km)",120,30,70,80]
["Temps requis pour la transformation, y compris le déchargement des produits (h)",2.5,1.5,2.5,2]
["Unité de poids des produits retournés de l'abattoir ",{"$f":"Configuration!C5","v":"lb"},{"$f":"Configuration!C6","v":"lb"},{"$f":"Configuration!C7","v":"lb"},{"$f":"Configuration!C8","v":"lb"},{"$f":"Configuration!C9","v":"lb"},{"$f":"Configuration!C10","v":"lb"},{"$f":"Configuration!C11","v":"lb"},{"$f":"Configuration!C12","v":"lb"},{"$f":"Configuration!C13","v":"lb"},{"$f":"Configuration!C14","v":"lb"}]
["Poids total des produits retournés de l'abattoir  ",1320,5000,450,1400]
["Coût de transport par unité de poids de produits retournés de l'abattoir ",{"$f":"IFERROR((((B9+B11)*B7)+((B10+B12)*B8)+B4*B5+B6)/B14,\"S/O\")","v":0.16931818181818181},9.8900000000000002E-2,0.3477777777777778,0.13250000000000001,"S/O","S/O","S/O","S/O","S/O","S/O"]
["Abattage "]
["Tarif chargé par l'usine de transformation ou l'abattoir ",160,{"$f":"24*25","v":600},300,900]
["Coût d'abattage par unité de poids de produits retournés de l'abattoir",{"$f":"IFERROR(B17/B14,\"S/O\")","v":0.12121212121212122},0.12,0.66666666666666663,0.6428571428571429,"S/O","S/O","S/O","S/O","S/O","S/O"]
[]
["fin de la feuille de calcul"]

{"sheet":"Coût de transformation","index":3,"n_rows":36,"n_cols":7,"rows_kept":36,"cut":false,"hidden":false,"merged":[]}
["Exemples de calculs de coût de transformation "]
["Type de transformation ","Frais chargés au transformateur ou boucher ","Unité de poids","Poids total du produit envoyé à la transformation ","Poids total du produit après transformation ","Coût par unité de poids de produit transformé ","Conversion"]
["Coupes de carcasses de dindon  (coût de transformation réparti uniformément entre les produits principaux et les sous-produits) ",1600,"lb",1500,1400,{"$f":"IFERROR(B3/E3,0)","v":1.1428571428571428},{"$f":"IFERROR(E3/D3,0)","v":0.93333333333333335}]
["Poitrine de dinde (totalité du coût de transformation attribuée à la coupe la plus chère seulement) ",1600,"lb",1500,500,{"$f":"IFERROR(B4/E4,0)","v":3.2},{"$f":"IFERROR(E4/D4,0)","v":0.33333333333333331}]
["Lapin transformé en saucisse ",1000,"lb",250,300,3.3333333333333335,1.2]
[null,null,null,null,null,0,0]
[null,null,null,null,null,0,0]
[null,null,null,null,null,0,0]
[null,null,null,null,null,0,0]
[null,null,null,null,null,0,0]
[null,null,null,null,null,0,0]
[null,null,null,null,null,0,0]
[null,null,null,null,null,0,0]
[null,null,null,null,null,0,0]
[null,null,null,null,null,0,0]
[null,null,null,null,null,0,0]
[null,null,null,null,null,0,0]
[null,null,null,null,null,0,0]
[null,null,null,null,null,0,0]
[null,null,null,null,null,0,0]
[null,null,null,null,null,0,0]
[null,null,null,null,null,0,0]
[null,null,null,null,null,0,0]
[null,null,null,null,null,0,0]
[null,null,null,null,null,0,0]
[null,null,null,null,null,0,0]
[null,null,null,null,null,0,0]
[null,null,null,null,null,0,0]
[null,null,null,null,null,0,0]
[null,null,null,null,null,0,0]
[null,null,null,null,null,0,0]
[null,null,null,null,null,0,0]
[null,null,null,null,null,0,0]
[null,null,null,null,null,0,0]
[]
["fin de la feuille de calcul"]

{"sheet":"Produits et marges ","index":4,"n_rows":36,"n_cols":15,"rows_kept":36,"cut":false,"hidden":false,"merged":[]}
[]
[]
[null,"Animal","Unité de poids d'abattage","Coût de transport par unité de poids ","Coût d'abattage par unité de poids ","Produit final à vendre  (=unité de vente)","Poids moyen par unité de vente  ","Coût de transformation par unité de poids de produit  transformé ","Conversion","Coût de production à la ferme par unité de vente ","Coût total avant commercialisation par unité de vente ","Prix moyen par unité de vente ","Marge sur coûts variables par unité de vente ","Unités vendues ","Marge totale sur coûts variables "]
[2,{"$f":"VLOOKUP(A4,Configuration!A$4:B$13,2)","v":"Bovin de boucherie"},{"$f":"VLOOKUP(A4,Configuration!A$4:E$14,3)","v":"lb"},{"$f":"VLOOKUP(A4,Configuration!A$4:E$14,4)","v":0.16931818181818181},{"$f":"VLOOKUP(A4,Configuration!A$4:E$14,5)","v":0.12121212121212122},"demi-carcasse",250,0,1,400,{"$f":"IFERROR(J4+H4*G4+(D4+E4)*G4/I4, 0)","v":472.63257575757575},650,{"$f":"IFERROR(L4-K4,0)","v":177.36742424242425},4,{"$f":"N4*M4","v":709.469696969697}]
[3,{"$f":"VLOOKUP(A5,Configuration!A$4:B$13,2)","v":"Porc"},{"$f":"VLOOKUP(A5,Configuration!A$4:E$14,3)","v":"lb"},{"$f":"VLOOKUP(A5,Configuration!A$4:E$14,4)","v":9.8900000000000002E-2},{"$f":"VLOOKUP(A5,Configuration!A$4:E$14,5)","v":0.12},"demi-carcasse",100,0,1,60,81.89,120,{"$f":"IFERROR(L5-K5,0)","v":38.11},96,{"$f":"N5*M5","v":3658.56}]
[4,{"$f":"VLOOKUP(A6,Configuration!A$4:B$13,2)","v":"Lapin"},{"$f":"VLOOKUP(A6,Configuration!A$4:E$14,3)","v":"lb"},{"$f":"VLOOKUP(A6,Configuration!A$4:E$14,4)","v":0.3477777777777778},{"$f":"VLOOKUP(A6,Configuration!A$4:E$14,5)","v":0.66666666666666663},"animal entier",4,0,1,4,8.0577777777777779,12,3.9422222222222221,100,394.22222222222223]
[5,{"$f":"VLOOKUP(A7,Configuration!A$4:B$13,2)","v":"Dindon"},{"$f":"VLOOKUP(A7,Configuration!A$4:E$14,3)","v":"lb"},{"$f":"VLOOKUP(A7,Configuration!A$4:E$14,4)","v":0.13250000000000001},{"$f":"VLOOKUP(A7,Configuration!A$4:E$14,5)","v":0.6428571428571429},"volaille entière  ",12,0,1,10,19.304285714285715,25,5.6957142857142848,30,170.87142857142854]
[5,{"$f":"VLOOKUP(A8,Configuration!A$4:B$13,2)","v":"Dindon"},{"$f":"VLOOKUP(A8,Configuration!A$4:E$14,3)","v":"lb"},{"$f":"VLOOKUP(A8,Configuration!A$4:E$14,4)","v":0.13250000000000001},{"$f":"VLOOKUP(A8,Configuration!A$4:E$14,5)","v":0.6428571428571429},"volaille entière ",16,0,1,12,24.405714285714286,32,7.5942857142857143,20,151.8857142857143]
[5,{"$f":"VLOOKUP(A9,Configuration!A$4:B$13,2)","v":"Dindon"},{"$f":"VLOOKUP(A9,Configuration!A$4:E$14,3)","v":"lb"},{"$f":"VLOOKUP(A9,Configuration!A$4:E$14,4)","v":0.13250000000000001},{"$f":"VLOOKUP(A9,Configuration!A$4:E$14,5)","v":0.6428571428571429},"poitrine",1,3.2,0.53,0.8,5.4629380053908356,6,0.53706199460916437,500,268.53099730458217]
[5,{"$f":"VLOOKUP(A10,Configuration!A$4:B$13,2)","v":"Dindon"},{"$f":"VLOOKUP(A10,Configuration!A$4:E$14,3)","v":"lb"},{"$f":"VLOOKUP(A10,Configuration!A$4:E$14,4)","v":0.13250000000000001},{"$f":"VLOOKUP(A10,Configuration!A$4:E$14,5)","v":0.6428571428571429},"pilon",1,0,1,0.8,1.5753571428571429,2.2000000000000002,0.62464285714285728,150,93.696428571428598]
[5,{"$f":"VLOOKUP(A11,Configuration!A$4:B$13,2)","v":"Dindon"},{"$f":"VLOOKUP(A11,Configuration!A$4:E$14,3)","v":"lb"},{"$f":"VLOOKUP(A11,Configuration!A$4:E$14,4)","v":0.13250000000000001},{"$f":"VLOOKUP(A11,Configuration!A$4:E$14,5)","v":0.6428571428571429},"poitrine",1,1.1399999999999999,0.93,0.8,2.7737173579109062,6,3.2262826420890938,500,1613.1413210445469]
[5,{"$f":"VLOOKUP(A12,Configuration!A$4:B$13,2)","v":"Dindon"},{"$f":"VLOOKUP(A12,Configuration!A$4:E$14,3)","v":"lb"},{"$f":"VLOOKUP(A12,Configuration!A$4:E$14,4)","v":0.13250000000000001},{"$f":"VLOOKUP(A12,Configuration!A$4:E$14,5)","v":0.6428571428571429},"pilon ",1,1.1399999999999999,0.93,0.8,2.7737173579109062,2.2000000000000002,-0.57371735791090606,150,-86.057603686635915]
[1,{"$f":"VLOOKUP(A13,Configuration!A$4:B$13,2)","v":"Catégorie de produit"},{"$f":"VLOOKUP(A13,Configuration!A$4:E$14,3)","v":"Unité de poids des produits retournés de l'abattoir"},{"$f":"VLOOKUP(A13,Configuration!A$4:E$14,4)","v":"Coût de transport par unité de poids "},{"$f":"VLOOKUP(A13,Configuration!A$4:E$14,5)","v":"Coût d'abattage par unité de poids "},"-",0,0,1,0,0,null,0,null,0]
[1,{"$f":"VLOOKUP(A14,Configuration!A$4:B$13,2)","v":"Catégorie de produit"},{"$f":"VLOOKUP(A14,Configuration!A$4:E$14,3)","v":"Unité de poids des produits retournés de l'abattoir"},{"$f":"VLOOKUP(A14,Configuration!A$4:E$14,4)","v":"Coût de transport par unité de poids "},{"$f":"VLOOKUP(A14,Configuration!A$4:E$14,5)","v":"Coût d'abattage par unité de poids "},"-",0,0,1,0,0,null,0,null,0]
[1,{"$f":"VLOOKUP(A15,Configuration!A$4:B$13,2)","v":"Catégorie de produit"},{"$f":"VLOOKUP(A15,Configuration!A$4:E$14,3)","v":"Unité de poids des produits retournés de l'abattoir"},{"$f":"VLOOKUP(A15,Configuration!A$4:E$14,4)","v":"Coût de transport par unité de poids "},{"$f":"VLOOKUP(A15,Configuration!A$4:E$14,5)","v":"Coût d'abattage par unité de poids "},"-",0,0,1,0,0,null,0,null,0]
[1,{"$f":"VLOOKUP(A16,Configuration!A$4:B$13,2)","v":"Catégorie de produit"},{"$f":"VLOOKUP(A16,Configuration!A$4:E$14,3)","v":"Unité de poids des produits retournés de l'abattoir"},{"$f":"VLOOKUP(A16,Configuration!A$4:E$14,4)","v":"Coût de transport par unité de poids "},{"$f":"VLOOKUP(A16,Configuration!A$4:E$14,5)","v":"Coût d'abattage par unité de poids "},"-",0,0,1,0,0,null,0,null,0]
[1,{"$f":"VLOOKUP(A17,Configuration!A$4:B$13,2)","v":"Catégorie de produit"},{"$f":"VLOOKUP(A17,Configuration!A$4:E$14,3)","v":"Unité de poids des produits retournés de l'abattoir"},{"$f":"VLOOKUP(A17,Configuration!A$4:E$14,4)","v":"Coût de transport par unité de poids "},{"$f":"VLOOKUP(A17,Configuration!A$4:E$14,5)","v":"Coût d'abattage par unité de poids "},"-",0,0,1,0,0,null,0,null,0]
[1,{"$f":"VLOOKUP(A18,Configuration!A$4:B$13,2)","v":"Catégorie de produit"},{"$f":"VLOOKUP(A18,Configuration!A$4:E$14,3)","v":"Unité de poids des produits retournés de l'abattoir"},{"$f":"VLOOKUP(A18,Configuration!A$4:E$14,4)","v":"Coût de transport par unité de poids "},{"$f":"VLOOKUP(A18,Configuration!A$4:E$14,5)","v":"Coût d'abattage par unité de poids "},"-",0,0,1,0,0,null,0,null,0]
[1,{"$f":"VLOOKUP(A19,Configuration!A$4:B$13,2)","v":"Catégorie de produit"},{"$f":"VLOOKUP(A19,Configuration!A$4:E$14,3)","v":"Unité de poids des produits retournés de l'abattoir"},{"$f":"VLOOKUP(A19,Configuration!A$4:E$14,4)","v":"Coût de transport par unité de poids "},{"$f":"VLOOKUP(A19,Configuration!A$4:E$14,5)","v":"Coût d'abattage par unité de poids "},"-",0,0,1,0,0,null,0,null,0]
[1,{"$f":"VLOOKUP(A20,Configuration!A$4:B$13,2)","v":"Catégorie de produit"},{"$f":"VLOOKUP(A20,Configuration!A$4:E$14,3)","v":"Unité de poids des produits retournés de l'abattoir"},{"$f":"VLOOKUP(A20,Configuration!A$4:E$14,4)","v":"Coût de transport par unité de poids "},{"$f":"VLOOKUP(A20,Configuration!A$4:E$14,5)","v":"Coût d'abattage par unité de poids "},"-",0,0,1,0,0,null,0,null,0]
[1,{"$f":"VLOOKUP(A21,Configuration!A$4:B$13,2)","v":"Catégorie de produit"},{"$f":"VLOOKUP(A21,Configuration!A$4:E$14,3)","v":"Unité de poids des produits retournés de l'abattoir"},{"$f":"VLOOKUP(A21,Configuration!A$4:E$14,4)","v":"Coût de transport par unité de poids "},{"$f":"VLOOKUP(A21,Configuration!A$4:E$14,5)","v":"Coût d'abattage par unité de poids "},"-",0,0,1,0,0,null,0,null,0]
[1,{"$f":"VLOOKUP(A22,Configuration!A$4:B$13,2)","v":"Catégorie de produit"},{"$f":"VLOOKUP(A22,Configuration!A$4:E$14,3)","v":"Unité de poids des produits retournés de l'abattoir"},{"$f":"VLOOKUP(A22,Configuration!A$4:E$14,4)","v":"Coût de transport par unité de poids "},{"$f":"VLOOKUP(A22,Configuration!A$4:E$14,5)","v":"Coût d'abattage par unité de poids "},"-",0,0,1,0,0,null,0,null,0]
[1,{"$f":"VLOOKUP(A23,Configuration!A$4:B$13,2)","v":"Catégorie de produit"},{"$f":"VLOOKUP(A23,Configuration!A$4:E$14,3)","v":"Unité de poids des produits retournés de l'abattoir"},{"$f":"VLOOKUP(A23,Configuration!A$4:E$14,4)","v":"Coût de transport par unité de poids "},{"$f":"VLOOKUP(A23,Configuration!A$4:E$14,5)","v":"Coût d'abattage par unité de poids "},"-",0,0,1,0,0,null,0,null,0]
[1,{"$f":"VLOOKUP(A24,Configuration!A$4:B$13,2)","v":"Catégorie de produit"},{"$f":"VLOOKUP(A24,Configuration!A$4:E$14,3)","v":"Unité de poids des produits retournés de l'abattoir"},{"$f":"VLOOKUP(A24,Configuration!A$4:E$14,4)","v":"Coût de transport par unité de poids "},{"$f":"VLOOKUP(A24,Configuration!A$4:E$14,5)","v":"Coût d'abattage par unité de poids "},"-",0,0,1,0,0,null,0,null,0]
[1,{"$f":"VLOOKUP(A25,Configuration!A$4:B$13,2)","v":"Catégorie de produit"},{"$f":"VLOOKUP(A25,Configuration!A$4:E$14,3)","v":"Unité de poids des produits retournés de l'abattoir"},{"$f":"VLOOKUP(A25,Configuration!A$4:E$14,4)","v":"Coût de transport par unité de poids "},{"$f":"VLOOKUP(A25,Configuration!A$4:E$14,5)","v":"Coût d'abattage par unité de poids "},"-",0,0,1,0,0,null,0,null,0]
[1,{"$f":"VLOOKUP(A26,Configuration!A$4:B$13,2)","v":"Catégorie de produit"},{"$f":"VLOOKUP(A26,Configuration!A$4:E$14,3)","v":"Unité de poids des produits retournés de l'abattoir"},{"$f":"VLOOKUP(A26,Configuration!A$4:E$14,4)","v":"Coût de transport par unité de poids "},{"$f":"VLOOKUP(A26,Configuration!A$4:E$14,5)","v":"Coût d'abattage par unité de poids "},"-",0,0,1,0,0,null,0,null,0]
[1,{"$f":"VLOOKUP(A27,Configuration!A$4:B$13,2)","v":"Catégorie de produit"},{"$f":"VLOOKUP(A27,Configuration!A$4:E$14,3)","v":"Unité de poids des produits retournés de l'abattoir"},{"$f":"VLOOKUP(A27,Configuration!A$4:E$14,4)","v":"Coût de transport par unité de poids "},{"$f":"VLOOKUP(A27,Configuration!A$4:E$14,5)","v":"Coût d'abattage par unité de poids "},"-",0,0,1,0,0,null,0,null,0]
[1,{"$f":"VLOOKUP(A28,Configuration!A$4:B$13,2)","v":"Catégorie de produit"},{"$f":"VLOOKUP(A28,Configuration!A$4:E$14,3)","v":"Unité de poids des produits retournés de l'abattoir"},{"$f":"VLOOKUP(A28,Configuration!A$4:E$14,4)","v":"Coût de transport par unité de poids "},{"$f":"VLOOKUP(A28,Configuration!A$4:E$14,5)","v":"Coût d'abattage par unité de poids "},"-",0,0,1,0,0,null,0,null,0]
[1,{"$f":"VLOOKUP(A29,Configuration!A$4:B$13,2)","v":"Catégorie de produit"},{"$f":"VLOOKUP(A29,Configuration!A$4:E$14,3)","v":"Unité de poids des produits retournés de l'abattoir"},{"$f":"VLOOKUP(A29,Configuration!A$4:E$14,4)","v":"Coût de transport par unité de poids "},{"$f":"VLOOKUP(A29,Configuration!A$4:E$14,5)","v":"Coût d'abattage par unité de poids "},"-",0,0,1,0,0,null,0,null,0]
[1,{"$f":"VLOOKUP(A30,Configuration!A$4:B$13,2)","v":"Catégorie de produit"},{"$f":"VLOOKUP(A30,Configuration!A$4:E$14,3)","v":"Unité de poids des produits retournés de l'abattoir"},{"$f":"VLOOKUP(A30,Configuration!A$4:E$14,4)","v":"Coût de transport par unité de poids "},{"$f":"VLOOKUP(A30,Configuration!A$4:E$14,5)","v":"Coût d'abattage par unité de poids "},"-",0,0,1,0,0,null,0,null,0]
[1,{"$f":"VLOOKUP(A31,Configuration!A$4:B$13,2)","v":"Catégorie de produit"},{"$f":"VLOOKUP(A31,Configuration!A$4:E$14,3)","v":"Unité de poids des produits retournés de l'abattoir"},{"$f":"VLOOKUP(A31,Configuration!A$4:E$14,4)","v":"Coût de transport par unité de poids "},{"$f":"VLOOKUP(A31,Configuration!A$4:E$14,5)","v":"Coût d'abattage par unité de poids "},"-",0,0,1,0,0,null,0,null,0]
[1,{"$f":"VLOOKUP(A32,Configuration!A$4:B$13,2)","v":"Catégorie de produit"},{"$f":"VLOOKUP(A32,Configuration!A$4:E$14,3)","v":"Unité de poids des produits retournés de l'abattoir"},{"$f":"VLOOKUP(A32,Configuration!A$4:E$14,4)","v":"Coût de transport par unité de poids "},{"$f":"VLOOKUP(A32,Configuration!A$4:E$14,5)","v":"Coût d'abattage par unité de poids "},"-",0,0,1,0,0,null,0,null,0]
[1,{"$f":"VLOOKUP(A33,Configuration!A$4:B$13,2)","v":"Catégorie de produit"},{"$f":"VLOOKUP(A33,Configuration!A$4:E$14,3)","v":"Unité de poids des produits retournés de l'abattoir"},{"$f":"VLOOKUP(A33,Configuration!A$4:E$14,4)","v":"Coût de transport par unité de poids "},{"$f":"VLOOKUP(A33,Configuration!A$4:E$14,5)","v":"Coût d'abattage par unité de poids "},"-",0,0,1,0,0,null,0,null,0]
[1,{"$f":"VLOOKUP(A34,Configuration!A$4:B$13,2)","v":"Catégorie de produit"},{"$f":"VLOOKUP(A34,Configuration!A$4:E$14,3)","v":"Unité de poids des produits retournés de l'abattoir"},{"$f":"VLOOKUP(A34,Configuration!A$4:E$14,4)","v":"Coût de transport par unité de poids "},{"$f":"VLOOKUP(A34,Configuration!A$4:E$14,5)","v":"Coût d'abattage par unité de poids "},"-",0,0,1,0,0,null,0,null,0]
[]
[null,"fin de la feuille de calcul"]