{"text_format":"1","workbook":"xlsx","n_sheets":9,"sheets":["Menu","Entrée des revenus et dépenses","Outil d'analyse financière","Planificateur des finances","Définitions","CommodityList","Sheet1","Benchmarks","BenchmarksLookup"],"not_rendered":{"charts":0,"images":2,"macros":1,"external_links":0,"defined_names":8,"comments":6,"pivot_tables":0},"unopened":[],"bounds":{"document_bytes":16777216,"sheet_cells":100000,"rows_first":2000,"rows_last":500,"rows_between":2000,"halvings":0,"cell_chars":16384,"cell_head_chars":4096},"cells_cut":0,"cells_raw":0,"read":"whole","date_system":"1900"}

{"sheet":"Menu","index":0,"n_rows":25,"n_cols":1,"rows_kept":25,"cut":false,"hidden":false,"merged":[]}
["Ceci est une calculatrice d'aide aux décisions d'affaire à la ferme qui comporte 5 feuilles de travail. Certains champs doivent être remplis par l'utilisateur. Elle peut avoir 10 colonnes de largeur et 125 rangées."]
["Bienvenue à la page Menu de l’Outil d'analyse financière pour les entreprises agricoles"]
[]
[]
[]
[]
[]
[]
[]
[]
{"$rows_left_out":16}
{"sheet":"Entrée des revenus et dépenses","index":1,"n_rows":122,"n_cols":23,"rows_kept":122,"cut":false,"hidden":false,"merged":[]}
["Ceci est une calculatrice d'aide aux décisions d'affaire à la ferme qui comporte 5 feuilles de travail. Certains champs doivent être remplis par l'utilisateur. Elle peut avoir 10 colonnes de largeur et 125 rangées."]
[null,"T1163, État A, État des résultats des activités d'une entreprise agricole","année:",2023]
[null,"Nom de l'entreprise"]
[null,"Revenu",null,null,null,null,"Sélectionnez votre type de ferme :"]
[null,"Ventes de produits","Code","Montant","% alloué au type de ferme",null,"Parc d’engraissement de bovins de boucherie"]
[null,null,{"$f":"CommodityList!A6","v":""},50,1,null,{"$f":"D6*E6","v":50},null,null,null,null,null,null,null,null,null,null,null,null,null,null,null,"Pomiculture"]
[null,null,{"$f":"CommodityList!A7","v":""},null,1,null,0,null,null,null,null,null,null,null,null,null,null,null,null,null,null,null,"Raisin"]
[null,null,{"$f":"CommodityList!A8","v":""},null,1,null,0,null,null,null,null,null,null,null,null,null,null,null,null,null,null,null,"Bovins de boucherie - Vache-veau"]
[null,null,{"$f":"CommodityList!A9","v":""},null,1,null,0,null,null,null,null,null,null,null,null,null,null,null,null,null,null,null,"Parc d’engraissement de bovins de boucherie"]
[null,null,{"$f":"CommodityList!A10","v":""},null,1,null,0,null,null,null,null,null,null,null,null,null,null,null,null,null,null,null,"élevage de chèvres laitières"]
{"$rows_left_out":113}
{"sheet":"Outil d'analyse financière","index":2,"n_rows":36,"n_cols":29,"rows_kept":36,"cut":false,"hidden":false,"merged":[]}
["Ceci est une calculatrice d'aide aux décisions d'affaire à la ferme qui comporte 5 feuilles de travail. Certains champs doivent être remplis par l'utilisateur. Elle peut avoir 10 colonnes de largeur et 125 rangées."]
["Outil d'analyse financière pour les entreprises agricoles"]
[null,null,null,null,"Sélectionnez le type de ferme aux fins de comparaison :"]
[null,null,null,null,"Parc d’engraissement de bovins de boucherie"]
[{"$f":"'Entrée des revenus et dépenses'!B3","v":"Nom de l'entreprise"},null,{"$f":"'Entrée des revenus et dépenses'!D2","v":2023},null,"Comparaison aux renseignements de référence",null,null,null,null,null,null,null,null,null,null,null,null,null,null,null,null,null,"Farm types",null,null,null,null,{"$f":"E4","v":"Parc d’engraissement de bovins de boucherie"}]
[null,null,"Votre ferme","Votre ferme",{"$f":"E4","v":"Parc d’engraissement de bovins de boucherie"},null,null,null,null,null,null,null,null,null,null,null,null,null,null,null,null,null,"Pomiculture"]
[null,null,{"$f":"IF('Entrée des revenus et dépenses'!G5=0,\"\",'Entrée des revenus et dépenses'!G5)","v":"Parc d’engraissement de bovins de boucherie"},null,"Toutes","Principales",null,null,null,null,null,null,null,null,null,null,null,null,null,null,null,null,"Raisin"]
[null,"Mesures financières","Total $","$ de revenu des activités agricoles",null,null,null,null,null,null,null,null,null,null,null,null,null,null,null,null,null,null,"Bovins de boucherie - Vache-veau",null,null,null,null,"All","Top"]
["$","Revenus des activités agricoles",{"$f":"SUM('Entrée des revenus et dépenses'!G6:G30,'Entrée des revenus et dépenses'!G114,'Entrée des revenus et dépenses'!G115)","v":50},{"$f":"IFERROR(C9/$C$9,\"\")","v":1},{"$f":"IFERROR(AB9,\"\")","v":""},{"$f":"IFERROR(AC9,\"\")","v":""},null,null,null,null,null,null,null,null,null,null,null,null,null,null,null,null,"Parc d’engraissement de bovins de boucherie",null,null,null,"Revenue from farming operations",{"$f":"HLOOKUP($AB$5,BenchmarksLookup!$C$6:$O$32,5,FALSE)","v":{"$error":"#N/A"}},{"$f":"HLOOKUP($AB$5,topbench,5,FALSE)","v":{"$error":"#N/A"}}]
["$","Coûts des produits vendus",{"$f":"SUM('Entrée des revenus et dépenses'!G54:G71,'Entrée des revenus et dépenses'!G73,'Entrée des revenus et dépenses'!G74,'Entrée des revenus et dépenses'!G75,'Entrée des revenus et dépenses'!G76,'Entrée des revenus et dépenses'!G77,'Entrée des revenus et dépenses'!G84,'Entrée des revenus et dépenses'!G85,'Entrée des revenus et dépenses'!G116)-'Entrée des revenus et dépenses'!G117","v":0},{"$f":"IFERROR(C10/$C$9,\"\")","v":0},{"$f":"IFERROR(AB10,\"\")","v":""},"",null,null,null,null,null,null,null,null,null,null,null,null,null,null,null,null,"élevage de chèvres laitières",null,null,null,"Cost of goods sold",{"$f":"HLOOKUP($AB$5,BenchmarksLookup!$C$6:$O$32,6,FALSE)","v":{"$error":"#N/A"}},{"$f":"HLOOKUP($AB$5,topbench,6,FALSE)","v":{"$error":"#N/A"}}]
{"$rows_left_out":27}
{"sheet":"Planificateur des finances","index":3,"n_rows":34,"n_cols":28,"rows_kept":34,"cut":false,"hidden":false,"merged":[]}
["Ceci est une calculatrice d'aide aux décisions d'affaire à la ferme qui comporte 5 feuilles de travail. Certains champs doivent être remplis par l'utilisateur. Elle peut avoir 10 colonnes de largeur et 125 rangées."]
["Planificateur des finances des entreprises agricoles"]
[]
[{"$f":"'Entrée des revenus et dépenses'!B3","v":"Nom de l'entreprise"},null,{"$f":"'Entrée des revenus et dépenses'!D2","v":2023},null,{"$f":"C4+1","v":2024},null,null,"Type de ferme aux fins de comparaison :"]
[null,null,"Votre ferme","Votre ferme","Unité à vendre",null,null,{"$f":"'Outil d''analyse financière'!E6","v":"Parc d’engraissement de bovins de boucherie"}]
[null,null,null,null,"Quantité vendue",null,{"$f":"F5","v":0},"Toutes","Principales"]
[null,null,{"$f":"IF('Entrée des revenus et dépenses'!G5=0,\"\",'Entrée des revenus et dépenses'!G5)","v":"Parc d’engraissement de bovins de boucherie"},null,"Prix",null,{"$f":"\"par \"&F5","v":"par "}]
[null,"Mesures financières","Total $","$ de revenu","Total $",{"$f":"\"$ \"&G7","v":"$ par "},null,{"$f":"\"$ \"&G7","v":"$ par "},{"$f":"\"$ \"&G7","v":"$ par "},null,null,null,null,null,null,null,null,null,null,null,null,null,null,null,null,null,"all","top"]
["$","Revenus des activités agricoles",{"$f":"SUM('Entrée des revenus et dépenses'!G6:G30,'Entrée des revenus et dépenses'!G114,'Entrée des revenus et dépenses'!G115)","v":50},{"$f":"IFERROR(C9/$C$9,\"\")","v":1},{"$f":"F6*F7","v":0},{"$f":"IFERROR(E9/$F$6,\"\")","v":""},null,{"$f":"IFERROR(AA9/$F$6,\"\")","v":""},{"$f":"IFERROR(AB9/$F$6,\"\")","v":""},null,null,null,null,null,null,null,null,null,null,null,null,null,null,null,null,null,{"$f":"E9","v":0},{"$f":"AA9","v":0}]
["$","Coûts des produits vendus",{"$f":"SUM('Entrée des revenus et dépenses'!G54:G71,'Entrée des revenus et dépenses'!G73,'Entrée des revenus et dépenses'!G74,'Entrée des revenus et dépenses'!G75,'Entrée des revenus et dépenses'!G76,'Entrée des revenus et dépenses'!G77,'Entrée des revenus et dépenses'!G84,'Entrée des revenus et dépenses'!G85,'Entrée des revenus et dépenses'!G116)-'Entrée des revenus et dépenses'!G117","v":0},{"$f":"IFERROR(C10/$C$9,\"\")","v":0},{"$f":"IFERROR($E$9*D10,\"\")","v":0},{"$f":"IFERROR(E10/$F$6,\"\")","v":""},null,{"$f":"IFERROR(AA10/$F$6,\"\")","v":""},{"$f":"IFERROR(AB10/$F$6,\"\")","v":""},null,null,null,null,null,null,null,null,null,null,null,null,null,null,null,null,null,{"$f":"IFERROR($AA$9*'Outil d''analyse financière'!E10,\"\")","v":""},{"$f":"IFERROR($AB$9*'Outil d''analyse financière'!F10,\"\")","v":""}]
{"$rows_left_out":25}
{"sheet":"Définitions","index":4,"n_rows":123,"n_cols":5,"rows_kept":123,"cut":false,"hidden":false,"merged":[]}
["Ceci est une calculatrice d'aide aux décisions d'affaire à la ferme qui comporte 5 feuilles de travail. Certains champs doivent être remplis par l'utilisateur. Elle peut avoir 10 colonnes de largeur et 125 rangées."]
["Sommaire d’analyse financière des entreprises agricoles de l’Ontario"]
["Rapports et repères financiers normalisés*"]
["Les résultats et les points de repère du sommaire financier des entreprises agricoles de l’Ontario utilisent un format de rapports financiers normalisés. "]
["Les dépenses sont groupées en 5 catégories principales pour l’analyse afin de permettre une comparaison au sein de la ferme et parmi les types de fermes. "]
["Les définitions des catégories de dépenses, des mesures financières et des ratios financiers sont présentées ci-dessous."]
["Catégories de revenus et de dépenses"]
[null,null,"Le calcul comprend :"]
["Les revenus des activités agricoles","+","Ventes de marchandises","+","Variation des stocks"]
[null,"+","Paiements d’assurance-récolte","+","Variation des comptes débiteurs  "]
{"$rows_left_out":114}
{"sheet":"CommodityList","index":5,"n_rows":253,"n_cols":6,"rows_kept":253,"cut":false,"hidden":true,"merged":[]}
[null,"Liste des produits",null,null,"Liste des paiements de programmes"]
[null,"Aliments préparés pour animaux et compléments protéiques (détaillées)",46,null,"Agri-protection (assurance-production, assurance-récolte) – Autres produits (y compris le bétail)",463]
[null,"Avoine",45,null,"Agri-protection (assurance-production, assurance-récolte) – Céréales, oléagineux et cultures spéciales",401]
[null,"Betterave à sucre (et mélasse)",268,null,"Agri-protection (assurance-production, assurance-récolte) – Cultures horticoles comestibles",402]
[null,"Blé",56,null,"Agri-protection (assurance-production, assurance-récolte) – Cultures horticoles non comestibles",470]
[{"$f":"IF('Entrée des revenus et dépenses'!B6<>0,VLOOKUP('Entrée des revenus et dépenses'!B6,$B$2:$C$255,2,FALSE),\"\")","v":""},"Bourrache",6,null,"Assurance des prix du bétail",667]
[{"$f":"IF('Entrée des revenus et dépenses'!B7<>0,VLOOKUP('Entrée des revenus et dépenses'!B7,$B$2:$C$255,2,FALSE),\"\")","v":""},"Cameline",282,null,"Assurance privée contre la grêle",407]
[{"$f":"IF('Entrée des revenus et dépenses'!B8<>0,VLOOKUP('Entrée des revenus et dépenses'!B8,$B$2:$C$255,2,FALSE),\"\")","v":""},"Canola",10,null,"Autres programmes d'Agri relance (revenus admissibles)Note1",627]
[{"$f":"IF('Entrée des revenus et dépenses'!B9<>0,VLOOKUP('Entrée des revenus et dépenses'!B9,$B$2:$C$255,2,FALSE),\"\")","v":""},"Carthame",50,null,"COVID-19 – Agri-relance – Programmes de retrait du bétail",699]
[{"$f":"IF('Entrée des revenus et dépenses'!B10<>0,VLOOKUP('Entrée des revenus et dépenses'!B10,$B$2:$C$255,2,FALSE),\"\")","v":""},"Chanvre",30,null,"COVID-19 – Autres paiements d'aide (revenus admissibles)",687]
{"$rows_left_out":244}
{"sheet":"Sheet1","index":6,"n_rows":253,"n_cols":8,"rows_kept":253,"cut":false,"hidden":true,"merged":[]}
[]
["Aliments préparés pour animaux et compléments protéiques (détaillées)",46,null,null,"Agri-protection (assurance-production, assurance-récolte) – Autres produits (y compris le bétail)",463]
["Avoine",45,null,null,"Agri-protection (assurance-production, assurance-récolte) – Céréales, oléagineux et cultures spéciales",401]
["Betterave à sucre (et mélasse)",268,null,null,"Agri-protection (assurance-production, assurance-récolte) – Cultures horticoles comestibles",402,null,"Intérêts"]
["Blé",56,null,null,"Agri-protection (assurance-production, assurance-récolte) – Cultures horticoles non comestibles",470,null,"Contrat-location (gaz, puits de pétrole, baux de surface, etc.)"]
["Bourrache",6,null,null,"Assurance des prix du bétail",667]
["Cameline",282,null,null,"Assurance privée contre la grêle",407,null,"Gravier"]
["Canola",10,null,null,"Autres programmes d'Agri relance (revenus admissibles)Note1",627,null,"Ristournes"]
["Carthame",50,null,null,"COVID-19 – Agri-relance – Programmes de retrait du bétail",699,null,"Camionnage (lié à l'agriculture seulement)"]
["Chanvre",30,null,null,"COVID-19 – Autres paiements d'aide (revenus admissibles)",687,null,"Reventes de produits achetés"]
{"$rows_left_out":244}
{"sheet":"Benchmarks","index":7,"n_rows":32,"n_cols":28,"rows_kept":32,"cut":false,"hidden":true,"merged":[]}
[null,null,"Ontario Farm Financial Analysis Summary"]
[null,null,"Benchmark Summary"]
["The Ontario Farm Financial Data Summary uses farm income and expense data to evaluate financial performance based on farm type."]
["The income and expense data used comes from selected Ontario farm businesses participating in business risk management programs."]
["Financial Measure and Ratio values are the median of the sample."]
[null,"Farm types","Beef cow calf",null,"Beef feedlot",null,"Sheep",null,"Swine Farrow to Finish",null,"Swine Finishing",null,"Dairy Goat",null,"Apple",null,"Greenhouse cucumber",null,"Greenhouse pepper",null,"Greenhouse tomato",null,"Greenhouse flower",null,"Field crops",null,"Grapes"]
[null,null,"All","Top","All","Top","All","Top","All","Top","All","Top","All","Top","All","Top","All","Top","All","Top","All","Top","All","Top","All","Top","All","Top"]
[]
[null,"Financial Measures","$ of Revenue from farming operations"]
["$","Revenue from farming operations",1,1,1,1,1,1,1,1,1,1,1,1,1,1,1,1,1,1,1,1,1,1,1,1,1,1]
{"$rows_left_out":23}
{"sheet":"BenchmarksLookup","index":8,"n_rows":32,"n_cols":28,"rows_kept":32,"cut":false,"hidden":true,"merged":[]}
[null,null,"Ontario Farm Financial Analysis Summary"]
[null,null,"Benchmark Summary"]
["The Ontario Farm Financial Data Summary uses farm income and expense data to evaluate financial performance based on farm type."]
["The income and expense data used comes from selected Ontario farm businesses participating in business risk management programs."]
["Financial Measure and Ratio values are the median of the sample."]
[null,"Farm types","Beef cow calf","Beef feedlot","Sheep","Swine Farrow to Finish","Swine Finishing","Dairy Goat","Apple","Greenhouse cucumber","Greenhouse pepper","Greenhouse tomato","Greenhouse flower","Field crops","Grapes","Beef cow calf","Beef feedlot","Sheep","Swine Farrow to Finish","Swine Finishing","Dairy Goat","Apple","Greenhouse cucumber","Greenhouse pepper","Greenhouse tomato","Greenhouse flower","Field crops","Grapes"]
[null,null,"All","All","All","All","All","All","All","All","All","All","All","All","All","Top","Top","Top","Top","Top","Top","Top","Top","Top","Top","Top","Top","Top"]
[]
[null,"Financial Measures","$ of Revenue from farming operations"]
["$","Revenue from farming operations",1,1,1,1,1,1,1,1,1,1,1,1,1,1,1,1,1,1,1,1,1,1,1,1,1,1]
{"$rows_left_out":22}